program: Gaussian 09
title: 000153369
version: EM64L-G09RevD.01
frameworkgroup: C1[X(C15H9BrO4)]
method: RPBEPBE
basis: SDD
operation: Freq
keyword: #p
keyword: freq=noraman
keyword: PBEPBE/SDD
title: #p freq=noraman PBEPBE/SDD
converged: NO YES NO NO
title: Mulliken charges:
elementType: Br O O O O C C C C C C C C C C C C C C C H H H H H H H H H
charge: -0.011713 -0.370739 -0.286828 -0.188727 -0.386868 0.289950 0.177095 0.016608 0.340248 0.032969 -0.277047 -0.569528 0.202636 0.597729 -0.557804 0.141641 -0.418088 -0.350367 -0.190292 -0.867326 0.299889 0.236252 0.292588 0.264894 0.242312 0.288336 0.297492 0.365924 0.388763
chargesum: 0.00000
title: Mulliken charges with hydrogens summed into heavy atoms:
elementType: Br O O O O C C C C C C C C C C C C C C C
charge: -0.011713 -0.004815 -0.286828 -0.188727 0.001895 0.289950 0.177095 0.016608 0.340248 0.032969 -0.277047 -0.269639 0.202636 0.597729 -0.321552 0.141641 -0.125500 -0.085473 0.052020 -0.281498
polarizability: 3.53821977e+02 -1.44230351e+01 2.13607424e+02 -1.34328450e+01 -3.15586398e+00 9.53751885e+01
1716.lowfreq: -8.0164 -0.0005 -0.0004 0.0005 2.9435 4.4340 23.2182 32.3779 50.4474
frequency: 23.2063 32.2866 50.4472 75.5831 120.0158 157.1146 171.6615 192.3150 209.0595 237.7355 256.8244 301.2865 308.0984 347.1928 363.6776 417.3523 427.1394 433.1416 439.5631 454.5003 474.9653 488.7356 511.6480 534.4674 555.5220 565.1888 586.1416 635.2361 661.0363 673.1126 718.7022 724.3826 758.6011 797.9334 805.4311 858.7718 867.4592 874.5111 896.8703 929.8063 949.6543 955.1032 973.8752 998.6938 1001.3662 1041.9662 1069.4235 1112.1802 1115.4799 1167.3308 1180.1489 1188.0101 1215.7658 1228.2495 1255.3715 1284.3949 1296.6549 1330.7412 1349.0189 1402.9207 1408.5765 1423.0924 1441.1507 1448.3313 1461.1427 1479.2238 1536.0771 1550.6432 1574.3329 1587.9536 1607.7934 1628.2890 2681.0987 3068.5590 3111.7591 3146.4981 3152.6180 3155.5126 3169.1956 3180.0080 3534.5547
redmass: 9.0604 10.6022 7.0490 13.2535 9.8359 8.8144 4.4571 6.0811 4.8321 5.1764 3.7953 6.3089 5.5783 6.4686 6.8989 8.7784 1.9258 3.6061 2.8622 6.6583 6.1073 4.8819 5.5126 8.1861 6.5201 4.8861 5.3677 5.9960 5.6301 3.3109 3.0305 6.5247 6.0346 8.6083 1.7469 2.5652 2.0198 2.0583 2.8632 1.4034 4.6216 1.9389 1.0651 1.3741 4.9306 3.0045 2.0971 1.1854 2.5567 1.5099 1.4134 1.4089 1.1360 1.8968 1.8412 2.6974 4.3697 5.6369 4.1343 6.5740 5.2653 4.6298 3.1115 3.5228 1.1367 3.9612 4.0207 7.2585 4.0769 6.3808 6.1925 6.3130 1.0710 1.0577 1.0917 1.0879 1.1085 1.0948 1.0926 1.0984 1.0658
irintensity: 0.8565 0.4778 5.5411 0.9521 0.4688 1.0825 1.9630 0.6828 0.7408 0.6504 1.9232 5.9036 8.9236 3.7158 5.3134 28.8183 61.4188 23.7318 38.8264 12.6983 10.2945 13.5748 25.5758 1.5967 12.1869 2.8537 15.7842 1.5440 8.4975 30.8747 2.8235 6.9985 8.6281 21.5582 66.3812 0.7626 21.5452 8.6157 24.8776 2.8374 19.8393 15.9193 127.0410 1.9671 29.3983 13.8088 41.6064 8.7170 100.6834 40.1592 50.8769 46.3924 41.7024 45.4648 57.0489 501.7220 15.3584 359.8535 54.4255 10.5574 12.9705 70.4406 17.6423 207.3640 10.6575 41.5987 49.3794 170.5287 45.9776 57.6181 27.4478 41.5962 195.0309 13.0439 9.8226 9.9666 3.9110 1.9873 0.4373 13.5228 42.9768
temp: 298.150 k
press: 1.00000 atm
elementType: 35 8 8 8 8 6 6 6 6 6 6 6 6 6 6 6 6 6 6 6 1 1 1 1 1 1 1 1 1
symmnumber: 1
zpe: 528746.3 jmol-1
zpe.correction: 0.201389 hartree
zpe.thermalcorrener: 0.217644 hartree
zpe.thermalcorrenthalpy: 0.218588 hartree
zpe.thermalcorrgfe: 0.155544 hartree
zpe.sumelectzpe: -890.001380 hartree
zpe.sumelectthermal: -889.985124 hartree
zpe.sumelectthermalent: -889.984180 hartree
zpe.sumelectthermalfe: -890.047225 hartree
dipole: -1.7053 0.9037 2.0120
dipole: 2.7879
quadrupole: -120.2218 -124.3915 -123.6509
quadrupole: -21.7475 -8.6497 2.8994
quadrupole: 2.5329 -1.6368 -0.8962 -21.7475 -8.6497 2.8994
hfenergy: -890.2027687 hartree
pointgroup: C01 [X(C15H9Br1O4)]
dipole: 0.7713769 0.2595415 -0.7353342 debye
polarizability: 355.5029496|0.6184226|212.3127606|10.6913147|-0.2035751|94.9888787 unknown
InChI: InChI=1S/C15H9BrO4/c16-6-7-4-9-13(11(18)5-7)15(20)12-8(14(9)19)2-1-3-10(12)17/h1-5,17-18H,6H2
charge 0 multiplicity 1
29 atoms
Br 5.591651 -0.958693 1.376671
O  1.524292 3.030275 -0.049918
O  -1.083027 2.519227 0.075694
O  0.004591 -2.888282 -0.230632
O  -3.55039 2.068029 0.215977
C  0.863269 -0.633345 -0.174869
C  0.602215 0.774775 -0.097699
C  -1.888418 0.269605 0.038206
C  -1.644297 -1.136984 -0.036629
C  -0.795363 1.256114 0.008524
C  -0.250505 -1.644327 -0.151582
C  2.177528 -1.131447 -0.280007
C  1.730098 1.658612 -0.128494
C  3.281443 -0.248715 -0.317847
C  3.04381 1.141506 -0.24506
C  -3.247031 0.734449 0.143722
C  -2.713846 -2.053927 -0.005323
C  -4.316163 -0.203505 0.174696
C  -4.046058 -1.580234 0.101099
C  4.677301 -0.776681 -0.457196
H  2.312647 -2.216802 -0.327393
H  3.895702 1.835128 -0.26265
H  -2.488093 -3.122377 -0.064722
H  -5.336783 0.181133 0.256191
H  -4.876567 -2.29341 0.126047
H  5.348485 -0.104748 -1.010943
H  4.711587 -1.794418 -0.869466
H  2.39006 3.515178 -0.061745
H  -2.642536 2.579264 0.177449
