program: Gaussian 09
title: 000153351
version: EM64L-G09RevD.01
frameworkgroup: C1[X(C9H10Cl2N2O2)]
method: RPBEPBE
basis: SDD
operation: Freq
keyword: #p
keyword: freq=noraman
keyword: PBEPBE/SDD
title: #p freq=noraman PBEPBE/SDD
converged: YES YES NO NO
title: Mulliken charges:
elementType: Cl Cl O O N N C C C C C C C C C H H H H H H H H H H
charge: -0.087540 -0.045179 -0.454323 -0.303226 -0.388304 -0.647960 -0.235102 -0.391737 0.640992 -0.340737 -0.321623 -0.220648 -0.220282 -0.096703 0.299111 0.225234 0.211472 0.273806 0.278623 0.288799 0.281109 0.259418 0.348484 0.305183 0.341133
chargesum: 0.00000
title: Mulliken charges with hydrogens summed into heavy atoms:
elementType: Cl Cl O O N N C C C C C C C C C
charge: -0.087540 -0.045179 -0.105838 -0.303226 -0.099504 -0.001644 -0.009868 0.093541 0.640992 -0.340737 -0.043000 0.060461 0.039136 -0.096703 0.299111
polarizability: 1.53958734e+02 2.53856829e+01 1.13411738e+02 -1.58218835e+01 1.55902660e+01 1.28141824e+02
1716.lowfreq: -4.8568 -2.2198 -0.0025 -0.0022 0.0011 6.2461 21.7244 35.1236 53.7188
frequency: 21.6826 35.0976 53.7072 67.2936 86.9587 155.1162 163.7231 169.6108 183.2626 242.8427 259.2185 277.5651 294.0826 311.0689 358.5623 363.4579 389.8161 411.1454 468.2212 480.0030 500.6416 532.3818 538.4917 569.1708 626.6904 642.4921 679.9973 713.8578 717.3627 783.3746 832.0907 862.0427 892.7298 956.9537 968.9289 996.6471 1020.6124 1026.7850 1067.0717 1083.4188 1139.2818 1156.3300 1161.8950 1212.3320 1219.6595 1271.4394 1294.2722 1319.4981 1342.2494 1365.3919 1379.9751 1402.8015 1457.2311 1468.8977 1504.7045 1569.6267 1600.2858 1603.4208 1654.3707 2952.8963 2976.6929 3070.5673 3165.5445 3183.1732 3186.5590 3542.3273 3556.2905 3563.3025 3701.1184
redmass: 9.3441 6.9172 4.9376 6.7220 4.3244 5.8915 6.5111 7.8162 13.0965 1.6993 1.5005 2.4556 2.3396 3.0095 4.8270 8.5928 8.2266 3.4076 3.2717 1.3389 2.7107 2.3041 1.8609 3.3526 4.2061 5.4880 5.1089 5.3282 5.6529 5.2891 1.3651 1.4072 3.1832 2.7637 1.4398 4.9208 3.7960 1.9073 2.6558 2.5054 1.4150 2.5315 1.6866 1.4382 1.2696 1.3399 1.2549 1.4387 1.7746 3.1953 4.4390 1.6578 1.5183 1.6158 2.2064 7.9534 6.3869 1.3292 3.7599 1.0689 1.0841 1.0937 1.0885 1.0963 1.0943 1.0487 1.0741 1.0661 1.1039
irintensity: 1.3010 2.9085 22.9288 0.5502 4.2611 0.1078 0.3339 1.5138 2.0969 98.7712 21.1126 54.4132 6.6623 2.5606 9.6373 10.1168 13.0013 12.1718 36.6976 452.1530 4.6547 58.0451 64.5704 29.8804 1.9743 13.3066 28.6941 6.4544 18.5778 49.1696 44.5171 21.5946 7.0269 52.1996 0.9889 49.5286 14.6613 4.0777 4.7188 22.1724 4.2836 66.0883 29.2480 3.2752 8.1756 0.1881 43.0734 39.2821 110.1146 12.4426 9.9984 26.0214 55.5820 45.9712 286.6040 32.4399 32.2519 83.2297 252.8203 79.1536 33.0435 5.0363 0.3907 0.7585 0.7974 34.8057 12.7972 6.9562 36.1343
temp: 298.150 k
press: 1.00000 atm
elementType: 17 17 8 8 7 7 6 6 6 6 6 6 6 6 6 1 1 1 1 1 1 1 1 1 1
symmnumber: 1
zpe: 477467.4 jmol-1
zpe.correction: 0.181858 hartree
zpe.thermalcorrener: 0.197470 hartree
zpe.thermalcorrenthalpy: 0.198414 hartree
zpe.thermalcorrgfe: 0.137001 hartree
zpe.sumelectzpe: -1527.927341 hartree
zpe.sumelectthermal: -1527.911728 hartree
zpe.sumelectthermalent: -1527.910784 hartree
zpe.sumelectthermalfe: -1527.972197 hartree
dipole: -2.6509 -0.1466 3.1407
dipole: 4.1126
quadrupole: -98.9265 -93.5899 -105.8588
quadrupole: 5.4453 -9.3420 10.1438
quadrupole: 0.5319 5.8685 -6.4004 5.4453 -9.3420 10.1438
hfenergy: -1528.1091985 hartree
pointgroup: C01 [X(C9H10Cl2N2O2)]
dipole: -0.7674554 0.8519458 -1.1415492 debye
dipolederiv: -0.2852793 0.1047542 -0.1845278 0.1046775 -0.2007561 0.1795399 -0.2051515 0.2150933 -0.6064452 -0.5685307 0.3765748 -0.0018363 0.4126751 -0.3703077 0.005804 0.0344797 -0.0217419 -0.1277579 -0.3184248 -0.2279831 0.0545926 -0.1256095 -0.748072 -0.2172768 0.1064991 -0.2665199 -0.6071223 -0.4249578 -0.0433671 0.0468074 -0.1679468 -0.7449294 0.1464144 0.057901 0.1942247 -0.9020965 -0.7218778 -0.0721721 -0.0831621 -0.3090678 -1.2367491 -0.1690116 0.012261 -0.0600554 -0.31999 -0.7796972 -0.0390853 -0.1311084 -0.1134223 -0.6646176 -0.4523472 -0.1910669 -0.5195588 -0.8274646 0.2757239 0.0310616 -0.0718836 -0.0940863 0.6210891 0.175697 -0.0934719 0.156484 0.4739875 0.3355847 -0.0803825 0.0145165 0.1238623 0.2775688 0.1298582 0.1762916 0.3653715 0.1913006 0.0379095 0.0283885 -0.0781971 -0.0428866 -0.1058465 0.0809181 -0.0563872 0.0421652 -0.3122507 0.2811611 -0.2487067 0.2602348 -0.217732 0.1507936 -0.2893013 0.2374378 -0.2682 0.8624077 -0.0405048 -0.0706653 0.0318032 -0.0917642 -0.0038737 -0.025192 0.0076791 -0.0215783 0.0640682 -0.3154655 0.1879889 -0.0855602 0.2094931 -0.2205105 0.0811946 -0.1205615 0.1025235 -0.2193522 -0.2532321 0.1025331 0.066304 0.1153703 -0.1807348 -0.0775086 0.0688418 -0.061375 -0.0081182 0.7623089 -0.6366547 -0.0270296 -0.6827684 0.4659717 0.0102544 -0.015934 0.0011135 0.199823 0.3812856 0.090083 0.009135 0.4905267 1.8709006 0.2707532 0.0195227 0.0561086 1.4267573 -0.0056683 0.0093511 -0.0123668 0.0043232 -0.0508691 0.0458488 -0.0136982 0.0761587 -0.0986488 -0.1466446 0.1455776 0.0325239 0.093548 -0.1465042 -0.0818366 -0.0215253 -0.06315 0.0598951 0.0945171 0.0000743 -0.0361274 0.0145077 0.1265615 0.075284 -0.0077877 0.0036165 0.0204787 0.1121756 0.0333473 0.0344483 0.0169204 0.1312335 -0.0020737 0.0386335 -0.0078985 0.0197739 0.4781924 -0.0158887 0.0616252 -0.014278 0.0943114 -0.001947 -0.0168252 -0.0253321 0.0679897 0.1181254 0.0409491 0.0263749 0.0475518 0.1373473 -0.0177407 0.0349383 -0.0178719 0.0323948 0.0987806 0.0552817 -0.045283 0.0654765 0.1120706 0.047512 -0.0449811 0.043354 0.0150123 0.0742492 0.2088388 0.0111974 0.1628751 0.3332487 0.0104332 -0.06037 0.0262736 0.3026147 0.4146687 0.005496 0.0798587 -0.0052865 0.1486815 0.0498846 0.041024 0.0351248 0.1231795 0.3956001 0.0146054 0.0276606 0.0030406 0.2039927 0.0248389 0.012251 0.0156701 0.1695632 unknown
polarizability: 133.5770293|-38.5900569|123.8697064|4.1157355|0.5451344|138.0655596 unknown
InChI: InChI=1S/C9H10Cl2N2O2/c10-5-1-2-6(7(11)3-5)8(14)4-13-9(12)15/h1-3,8,13-14H,4,12H2
charge 0 multiplicity 1
25 atoms
Cl 0.238215 1.158958 -2.498973
Cl 3.909983 -2.072959 0.091545
O  -0.712114 2.579813 1.674787
O  -2.53389 -1.783561 0.74278
N  -2.418389 0.112897 -0.633723
N  -2.523498 -2.041499 -1.576071
C  -0.870932 1.814547 0.425229
C  -2.224429 1.033627 0.48052
C  0.324308 0.88496 0.319758
C  0.893733 0.491934 -0.910468
C  0.896559 0.334501 1.495056
C  1.978577 -0.400042 -1.010624
C  1.982785 -0.562107 1.444989
C  2.506273 -0.917326 0.18708
C  -2.489941 -1.269203 -0.416096
H  -0.880359 2.505459 -0.44339
H  -3.051206 1.774553 0.527414
H  -2.251627 0.427731 1.403282
H  0.479725 0.642831 2.457778
H  -2.374959 0.479453 -1.585103
H  2.395934 -0.67701 -1.981085
H  2.40992 -0.976477 2.361902
H  -1.500999 3.166667 1.796728
H  -2.393849 -1.662842 -2.511703
H  -2.589021 -3.048208 -1.452412
