program: Gaussian 09
title: 000013671
version: EM64L-G09RevD.01
frameworkgroup: C1[X(C7H7N3O3)]
method: RPBEPBE
basis: SDD
operation: Freq
keyword: #pfreq=noraman
keyword: PBEPBE/SDD
title: #p freq=noraman PBEPBE/SDD
converged: NO NO NO NO
title: Mulliken charges:
elementType: O O O N N N C C C C C C C H H H H H H H
charge: -0.210963 -0.208159 -0.243471 -0.159025 0.021787 0.068681 0.433265 -0.309649 -0.318351 0.399373 -0.370890 -0.348883 -0.672336 0.257087 0.293411 0.289689 0.291377 0.252325 0.282392 0.252340
chargesum: 0.00000
title: Mulliken charges with hydrogens summed into heavy atoms:
elementType: O O O N N N C C C C C C C
charge: -0.210963 -0.208159 -0.243471 -0.159025 0.021787 0.068681 0.433265 -0.052562 -0.024939 0.399373 -0.081201 -0.057506 0.114721
polarizability: 2.17898929e+02 6.81860575e+00 1.16042782e+02 1.01928620e-04 -3.24421582e-03 4.60134059e+01
1716.lowfreq: -10.6249 -6.6085 -6.3491 -0.0006 0.0004 0.0004 33.6908 69.9687 70.1843
frequency: 33.6398 69.9653 70.1168 142.6715 176.5336 187.5248 248.2391 279.3178 305.0153 376.7411 378.7312 413.7835 430.5582 503.7863 511.9037 517.9882 623.4407 664.9144 680.8745 737.4096 772.6835 798.4106 831.4733 847.1076 868.8495 982.6094 996.1495 1006.2314 1040.9637 1098.5424 1104.1427 1114.6910 1165.4451 1184.7990 1223.1818 1298.5155 1315.7432 1353.4041 1370.8197 1410.1061 1418.2384 1435.8592 1470.4589 1487.3164 1488.3371 1592.5019 1611.3088 2994.5378 3090.7533 3106.4332 3171.1313 3180.1387 3189.7602 3205.0726
redmass: 4.8190 7.3238 5.4776 8.7371 1.4360 2.7586 8.4602 6.2938 6.7751 4.1427 5.5789 2.9676 6.0627 7.8648 3.2456 6.0447 7.0981 4.5989 7.7111 4.7570 6.8317 8.2818 1.3099 3.6761 1.5709 1.3461 3.1139 1.3373 6.1501 2.9369 1.3192 1.3622 1.6213 1.4700 4.5074 1.3120 3.6772 6.8487 8.8707 3.6176 1.6595 3.4199 1.1032 1.0463 2.6870 8.1324 6.4120 1.0322 1.1030 1.0997 1.0884 1.0903 1.0966 1.0958
irintensity: 5.3713 0.3538 0.9613 6.5930 0.8247 0.9564 2.8945 0.5825 0.2884 3.7158 1.3784 0.1618 1.7265 1.3275 9.6038 3.7949 3.1187 25.5462 7.1324 3.5079 78.1900 41.9016 11.5849 263.5933 67.1300 1.8380 1.5944 0.0312 183.2819 13.8949 0.0103 17.1653 64.8777 63.2325 413.6630 15.1006 5.9653 175.0740 128.9499 17.5549 39.0228 50.8586 33.5819 24.1156 55.6019 3.9218 139.5664 17.4922 14.1723 1.8440 3.5883 1.2014 4.1175 0.5306
temp: 298.150 k
press: 1.00000 atm
elementType: 8 8 8 7 7 7 6 6 6 6 6 6 6 1 1 1 1 1 1 1
symmnumber: 1
zpe: 368323.4 jmol-1
zpe.correction: 0.140287 hartree
zpe.thermalcorrener: 0.151857 hartree
zpe.thermalcorrenthalpy: 0.152801 hartree
zpe.thermalcorrgfe: 0.101584 hartree
zpe.sumelectzpe: -659.777845 hartree
zpe.sumelectthermal: -659.766275 hartree
zpe.sumelectthermalent: -659.765331 hartree
zpe.sumelectthermalfe: -659.816548 hartree
dipole: -3.7102 3.1410 0.0017
dipole: 4.8612
quadrupole: -106.2673 -69.4213 -74.5863
quadrupole: -10.2663 0.0010 0.0008
quadrupole: -22.8423 14.0037 8.8387 -10.2663 0.0010 0.0008
hfenergy: -659.9181318 hartree
pointgroup: C01 [X(C7H7N3O3)]
dipole: -1.4267157 1.2737187 0.0012592 debye
dipolederiv: -0.8778362 -0.1947156 0.0000702 -0.3411529 -0.6333657 -0.0000481 0.0002868 0.000189 -0.2331795 -0.783247 0.2004283 0.0000755 0.3528753 -0.7048263 0.0000843 0.0003098 -0.0002327 -0.231231 -1.6802611 -0.5789121 -0.0001301 0.1202207 -0.2005451 -0.0000386 0.0003243 0.00008 -0.1795789 -1.3536033 -0.0829411 0.000112 -1.0380347 -0.4807133 -0.0000598 -0.0005073 -0.0002202 -0.0938944 2.1996653 -0.0581885 -0.0003587 -0.0789582 1.0887469 -0.0000543 -0.0005066 0.0000198 0.191971 1.685231 0.8257095 0.0002265 1.0978403 0.45544 0.0001597 0.000289 0.0001464 -0.0556629 1.5116247 -0.0333461 -0.0001755 0.0054714 0.0693583 -0.0000742 -0.0001239 -0.0000403 0.0997006 -0.5334543 -0.0773666 0.000021 -0.3501721 0.0241902 0.000118 -0.0001032 0.0000879 -0.1796681 -0.4448968 0.1457113 0.0000818 0.3874284 -0.0582082 -0.0000317 0.0001661 0.0000089 -0.1362843 -1.0348055 0.0683551 0.0002345 0.1144145 -0.0284536 0.0000094 0.0001595 0.0000021 0.0460167 0.3778009 0.0278668 -0.0000451 -0.2306648 0.0170025 0.000082 -0.0001871 -0.0000012 -0.0939044 0.3525372 -0.093918 -0.0000696 0.1801682 0.0132388 -0.0000102 -0.0001682 0.0000673 -0.0959477 0.001448 -0.155468 -0.0000375 -0.1629906 0.1151419 -0.0000643 0.0000797 -0.0000188 0.214862 0.0559125 0.0742781 0.0000387 0.0811937 -0.0204811 -0.0000688 0.0000622 -0.0000764 0.1609575 0.0808498 -0.0551099 0.0000047 -0.0361466 0.0566539 -0.0000228 0.0000583 -0.0000326 0.1671672 0.0961832 -0.0574656 -0.0000114 -0.0230425 0.0683015 -0.0000372 -0.00001 -0.0000085 0.1704723 0.1022589 0.054448 0.000018 0.0130141 0.0599078 -0.0000333 0.0000223 -0.0000377 0.1684438 0.1279321 -0.035535 -0.0864571 0.0198389 -0.0023866 -0.0478332 -0.042508 -0.0695418 -0.0314422 -0.0113409 0.061702 0.0001095 -0.1311538 0.1635037 0.0000754 -0.0000219 0.0000056 0.1426639 0.1280017 -0.0355326 0.0862926 0.0198505 -0.0025056 0.0478478 0.0423781 0.0696032 -0.0314617 unknown
polarizability: 218.1869873|4.1315371|115.7547156|-0.0217136|0.0190648|46.013414 unknown
InChI: InChI=1S/C7H7N3O3/c1-9(8-11)6-2-4-7(5-3-6)10(12)13/h2-5H,1H3
charge 0 multiplicity 1
20 atoms
O  3.956149 0.944723 -0.000688
O  3.784954 -1.33232 -0.000683
O  -4.416677 -0.79388 0.00023
N  -2.427234 0.291079 0.000532
N  3.265147 -0.148587 -0.000116
N  -3.149164 -0.931208 -0.00006
C  -1.009428 0.170471 0.000305
C  -0.203146 1.342632 0.0006
C  -0.388913 -1.114561 -0.000112
C  1.791752 -0.038209 -0.000005
C  1.19839 1.240319 0.000436
C  1.008323 -1.216082 -0.000254
C  -3.123373 1.590193 0.001353
H  -0.660313 2.334801 0.0010
H  -1.009224 -2.011816 -0.000283
H  1.83557 2.128363 0.000628
H  1.506297 -2.189049 -0.00056
H  -2.866588 2.170934 0.903868
H  -4.204122 1.373128 0.001734
H  -2.8674 2.17167 -0.900925
