program: Gaussian 09
title: 000153337
version: EM64L-G09RevD.01
frameworkgroup: C1[X(C11H12N4O4)]
method: RPBEPBE
basis: SDD
operation: Freq
keyword: #p
keyword: freq=noraman
keyword: PBEPBE/SDD
title: #p freq=noraman PBEPBE/SDD
converged: YES YES NO NO
title: Mulliken charges:
elementType: O O O O N N N N C C C C C C C C C C C H H H H H H H H H H H H
charge: -0.295488 -0.207662 -0.203666 -0.217100 -0.040222 -0.182390 -0.083130 0.042742 -0.128565 -0.080650 -0.143427 -0.212825 -0.462267 -0.460736 0.084137 0.156395 0.310900 -0.362736 -0.644239 0.257667 0.237738 0.263264 0.296794 0.241237 0.226419 0.228773 0.259000 0.293787 0.302270 0.261779 0.262200
chargesum: 0.00000
title: Mulliken charges with hydrogens summed into heavy atoms:
elementType: O O O O N N N N C C C C C C C C C C C
charge: -0.295488 -0.207662 -0.203666 -0.217100 -0.040222 -0.182390 -0.083130 0.042742 0.129102 0.157087 0.119838 0.083970 0.005389 0.027037 0.084137 0.156395 0.310900 -0.068949 0.182011
polarizability: 2.78237631e+02 -1.46797889e+01 1.58464932e+02 4.68513023e+00 5.94160299e+00 9.42345661e+01
1716.lowfreq: -9.3533 -4.5667 -2.1941 0.0002 0.0003 0.0009 31.8713 43.2426 57.6897
frequency: 31.8552 43.2304 57.6891 67.0209 89.7540 143.7279 151.6742 167.7868 202.1879 215.9257 245.1817 252.5528 274.7194 329.6888 342.2939 357.5800 396.6548 407.5819 447.5915 469.5744 500.0568 579.0679 592.3310 603.0681 676.5157 688.5642 700.7963 704.3810 711.5375 729.9085 750.9056 763.6492 782.9756 812.4283 867.1623 879.4895 880.6105 905.5898 915.7371 959.7629 969.2736 1022.2376 1030.3984 1054.2321 1060.9504 1109.3577 1115.9501 1126.6472 1135.1432 1156.6948 1183.6697 1190.4514 1206.6854 1220.6351 1230.9336 1246.7631 1265.0843 1300.2851 1306.4116 1320.6952 1323.3773 1335.4501 1341.7158 1352.8116 1355.5019 1381.7042 1406.0038 1431.4283 1458.2528 1463.5018 1473.5672 1477.4936 1481.6311 1483.8990 1549.4543 2996.1969 3004.0133 3012.1230 3020.2770 3062.1815 3065.8775 3081.6769 3104.9105 3120.3419 3122.3992 3136.5171 3254.7131
redmass: 8.0558 5.3132 5.5601 5.9915 7.0290 4.3161 1.0511 4.9469 6.3359 3.4651 5.0956 5.3876 4.9750 3.4925 4.4605 8.1044 5.7324 4.8297 4.3666 7.0243 5.2298 6.5554 5.2706 5.9317 6.0192 7.5608 3.9602 2.7704 6.4915 9.5150 12.4605 4.4234 4.2198 4.1565 3.8993 1.4012 6.1842 4.0740 3.2533 2.9126 2.7075 1.3762 1.5220 2.5457 1.8810 3.2013 1.6853 1.3135 1.5254 1.8887 1.5659 1.4998 4.0992 2.1297 1.2398 1.4916 1.5973 2.8122 1.6702 5.0469 1.3996 1.3860 10.9946 1.8844 1.4807 4.1067 3.4593 2.3671 1.0941 4.1052 1.1084 2.0902 1.0736 1.1537 8.8721 1.0647 1.0609 1.0855 1.0327 1.0979 1.0901 1.0981 1.0875 1.0947 1.1017 1.1053 1.0996
irintensity: 0.2424 1.9768 1.9089 3.0434 3.4014 0.5114 0.0587 7.3175 6.9870 11.7323 0.6164 4.5544 6.8099 0.6848 3.3998 5.5506 3.0233 12.7349 3.6029 4.4503 8.6799 2.5762 1.9509 0.6677 6.1074 10.5901 5.5764 12.2361 2.6328 3.0061 13.6948 50.7022 13.4366 82.5933 51.5211 23.9063 41.2714 9.8360 10.8864 23.6993 4.3623 1.3585 8.2669 7.1191 1.5204 30.3069 4.7999 0.3839 3.5757 70.8632 0.9875 38.7315 179.0598 72.5860 1.6073 50.5501 114.6714 137.9412 27.6818 10.8118 1.0718 3.2611 134.3525 0.8184 3.1986 53.8807 5.1764 18.3127 15.2883 92.9947 12.6225 7.3237 19.0664 22.7576 24.0120 15.7900 24.5437 20.0890 12.6627 17.0551 1.4350 11.4635 15.6525 39.9764 6.8995 3.4461 2.8195
temp: 298.150 k
press: 1.00000 atm
elementType: 8 8 8 8 7 7 7 7 6 6 6 6 6 6 6 6 6 6 6 1 1 1 1 1 1 1 1 1 1 1 1
symmnumber: 1
zpe: 605599.5 jmol-1
zpe.correction: 0.230661 hartree
zpe.thermalcorrener: 0.246837 hartree
zpe.thermalcorrenthalpy: 0.247781 hartree
zpe.thermalcorrgfe: 0.185793 hartree
zpe.sumelectzpe: -944.689716 hartree
zpe.sumelectthermal: -944.673540 hartree
zpe.sumelectthermalent: -944.672596 hartree
zpe.sumelectthermalfe: -944.734584 hartree
dipole: -3.4865 -0.3907 1.3636
dipole: 3.7641
quadrupole: -142.1459 -111.5518 -106.7156
quadrupole: 5.8281 -9.5608 -3.5630
quadrupole: -22.0081 8.5860 13.4222 5.8281 -9.5608 -3.5630
hfenergy: -944.9203769 hartree
pointgroup: C01 [X(C11H12N4O4)]
dipole: 1.3727816 0.1274363 0.5406228 debye
polarizability: 278.4670906|-13.0637394|158.7095404|-6.5389206|-1.1087831|93.7604984 unknown
InChI: InChI=1S/C11H12N4O4/c1-14-7(15(16)17)4-12-11(14)8-5-2-3-6-10(18-6)9(5)19-13-8/h4-6,9-10H,2-3H2,1H3
charge 0 multiplicity 1
31 atoms
O  4.948573 0.451119 -0.705918
O  2.121483 -2.050562 -0.038725
O  -5.233675 1.269697 0.093158
O  -4.940329 -0.984228 0.40925
N  0.702606 -1.829696 0.082086
N  -2.100615 -0.601364 0.11865
N  -1.050095 1.398065 -0.280662
N  -4.486638 0.214943 0.189607
C  4.122709 -0.613754 -0.021698
C  4.487272 0.630156 0.735973
C  2.741492 -0.769172 -0.621213
C  1.698603 0.327355 -0.295399
C  3.43658 1.709377 0.975068
C  2.010708 1.110633 1.008969
C  0.449771 -0.53788 -0.116066
C  -0.87892 0.044009 -0.084007
C  -3.074853 0.40936 0.041995
C  -2.402766 1.623043 -0.201987
C  -2.314353 -2.048267 0.360895
H  4.658833 -1.552211 0.166487
H  5.320051 0.565098 1.447058
H  2.815065 -0.947136 -1.711161
H  1.579119 1.038745 -1.128063
H  3.517577 2.467465 0.173546
H  3.642121 2.223874 1.930941
H  1.922371 0.431849 1.879432
H  1.258588 1.909377 1.127447
H  -2.847208 2.607357 -0.318384
H  -1.333464 -2.543246 0.356343
H  -2.814171 -2.19573 1.330458
H  -2.962836 -2.467678 -0.42328
