program: Gaussian 09
title: 000153336
version: EM64L-G09RevD.01
frameworkgroup: C1[X(C15H14O6)]
method: RPBEPBE
basis: SDD
operation: Freq
keyword: #pfreq=noraman
keyword: PBEPBE/SDD
title: #p freq=noraman PBEPBE/SDD
converged: YES YES NO NO
title: Mulliken charges:
elementType: O O O O O O C C C C C C C C C C C C C C C H H H H H H H H H H H H H H
charge: -0.325095 -0.347882 -0.396540 -0.456720 -0.441097 -0.424102 -0.643978 0.521346 0.282397 0.005714 -0.529119 -0.418077 0.224401 0.265514 0.159724 0.193510 -0.313251 -0.585272 -0.588140 0.383882 -0.523797 0.259781 0.244578 0.259127 0.262817 0.238688 0.254853 0.247023 0.375967 0.371613 0.378845 0.226939 0.227108 0.242334 0.366910
chargesum: 0.00000
title: Mulliken charges with hydrogens summed into heavy atoms:
elementType: O O O O O O C C C C C C C C C C C C C C C
charge: -0.325095 -0.347882 -0.020573 -0.085107 -0.062253 -0.057193 -0.139619 0.521346 0.282397 0.005714 -0.269992 -0.155260 0.224401 0.265514 0.159724 0.193510 -0.074564 -0.330418 -0.341117 0.383882 0.172584
polarizability: 2.44316902e+02 -5.03805265e+00 1.98241346e+02 9.90045259e+00 7.88588013e+00 1.41883690e+02
1716.lowfreq: -5.3279 -0.0005 -0.0002 0.0004 4.3577 8.0719 12.3616 18.8444 44.2814
frequency: 11.1971 18.7010 44.2444 59.3174 83.9624 121.8288 138.5936 171.5371 201.9599 209.6620 216.2278 224.8570 226.5470 289.4365 294.0891 319.0738 331.5884 338.2746 378.8682 383.2549 389.3510 419.2673 438.8713 447.4570 464.9983 493.1714 498.2776 510.0991 547.0357 571.8124 583.9394 594.1825 597.4795 614.3316 622.7640 646.3076 703.9677 711.2556 722.3489 736.1207 783.4744 798.5912 811.9532 830.4774 876.8762 914.0793 932.8401 960.3380 990.0435 995.3627 1012.9417 1033.9390 1042.9011 1115.0790 1116.1735 1137.4354 1142.7781 1153.5992 1162.3117 1175.2496 1184.5757 1193.7980 1215.5555 1230.0579 1259.9411 1268.7470 1285.9466 1305.7981 1336.4931 1386.7983 1400.6492 1405.1022 1435.5885 1436.0460 1454.7740 1461.8887 1463.8724 1476.8496 1490.5635 1498.1378 1563.9736 1597.3377 1600.5620 1629.0025 1649.0907 2442.4292 2965.7001 3023.5062 3055.6049 3122.2181 3126.5026 3141.7609 3153.3796 3159.3707 3162.3765 3172.8209 3514.5794 3571.4080 3581.0905
redmass: 5.2335 6.8530 5.6868 4.3678 5.4188 7.6813 5.4594 4.4258 4.9344 3.4103 2.6293 2.0641 4.0265 4.4793 4.0121 5.0329 5.2705 5.5248 3.2961 1.5833 3.0854 1.1177 4.2851 3.2383 5.8763 1.1201 5.2508 6.2279 5.8988 6.1232 5.1840 4.7714 3.7244 4.6673 3.5641 4.3826 3.7724 4.1614 3.4034 5.6992 2.2275 1.6151 1.8179 2.2090 1.6135 3.0583 1.3365 2.6989 4.6034 8.2336 3.4528 4.9070 1.0745 1.4144 2.0939 1.6017 1.5852 1.3380 1.3969 1.5635 1.2622 1.4840 2.0452 1.6556 2.7566 2.6410 1.5442 1.5028 4.4947 5.0822 7.0070 4.2992 1.8188 1.3461 1.3137 2.4573 1.0525 1.1548 3.8056 2.8501 2.5531 7.3992 4.8899 6.5044 4.2385 1.0787 1.0324 1.0650 1.1044 1.0963 1.1001 1.0878 1.0924 1.0929 1.0957 1.0925 1.0645 1.0658 1.0660
irintensity: 2.3097 0.0952 2.3577 2.3875 2.6087 0.8801 1.7435 1.6230 2.8996 0.3254 1.7613 0.9210 0.7244 6.6002 17.9124 9.4711 4.4892 1.5136 7.0880 43.1956 30.3086 194.6887 8.6579 11.6365 6.1520 137.5630 3.8215 6.4017 26.9660 5.4333 7.4628 4.4253 0.5863 28.6166 20.6590 13.7926 23.5826 8.7340 18.9811 20.3015 58.4967 3.4373 4.4502 80.0201 17.8461 13.4003 0.5700 52.9909 46.6364 51.0752 55.5047 48.9613 142.3697 14.8331 49.9146 334.9138 35.3761 29.4428 34.0752 19.3823 70.4880 78.3949 120.2066 141.5019 148.2876 23.1674 15.7757 11.3721 234.0026 30.9374 5.2029 36.5454 65.5951 73.8276 35.6957 11.4679 13.3416 74.9165 227.8981 119.0783 17.3142 56.5868 215.9032 4.2376 670.0828 449.6497 66.0592 14.8640 43.6173 0.9328 23.9078 4.8099 2.5298 3.4329 10.8555 1.7633 79.6464 45.2279 70.9097
temp: 298.150 k
press: 1.00000 atm
elementType: 8 8 8 8 8 8 6 6 6 6 6 6 6 6 6 6 6 6 6 6 6 1 1 1 1 1 1 1 1 1 1 1 1 1 1
symmnumber: 1
zpe: 686576.3 jmol-1
zpe.correction: 0.261503 hartree
zpe.thermalcorrener: 0.280733 hartree
zpe.thermalcorrenthalpy: 0.281677 hartree
zpe.thermalcorrgfe: 0.212236 hartree
zpe.sumelectzpe: -1029.808243 hartree
zpe.sumelectthermal: -1029.789013 hartree
zpe.sumelectthermalent: -1029.788069 hartree
zpe.sumelectthermalfe: -1029.857510 hartree
dipole: -0.9820 -2.1445 2.1836
dipole: 3.2142
quadrupole: -96.0708 -127.1481 -113.9796
quadrupole: -13.4537 -7.6309 3.2872
quadrupole: 16.3287 -14.7486 -1.5801 -13.4537 -7.6309 3.2872
hfenergy: -1030.069746 hartree
pointgroup: C01 [X(C15H14O6)]
dipole: 0.4219435 0.978669 0.6806911 debye
polarizability: 243.747186|-8.6455158|193.7418611|-9.5084055|-17.5851701|146.9528907 unknown
InChI: InChI=1S/C15H14O6/c1-21-14-3-2-8(4-10(14)17)5-11(18)15-12(19)6-9(16)7-13(15)20/h2-4,6-7,16-17,19-20H,5H2,1H3
charge 0 multiplicity 1
35 atoms
O  4.879245 0.686418 0.890679
O  -1.158838 -2.651219 -0.218222
O  -3.033546 -1.988536 1.217411
O  -1.107608 1.284884 -1.864083
O  3.791769 2.051595 -1.136376
O  -4.748501 2.52722 1.011111
C  0.118723 -1.277184 -1.715501
C  1.370973 -0.777402 -0.982102
C  -1.041836 -1.463131 -0.746363
C  -1.980091 -0.412236 -0.344125
C  2.005575 0.423358 -1.387447
C  1.917775 -1.52328 0.091084
C  -2.97232 -0.736254 0.676063
C  -2.017012 0.931144 -0.858191
C  3.167217 0.864652 -0.732574
C  3.711426 0.108037 0.343211
C  3.088157 -1.084985 0.755738
C  -3.899163 0.222736 1.143587
C  -2.937481 1.884354 -0.397602
C  -3.869191 1.520833 0.605912
C  5.521674 -0.012283 2.003869
H  -0.147456 -0.578009 -2.519507
H  0.312732 -2.275989 -2.146447
H  1.60276 1.02334 -2.207672
H  1.427678 -2.450445 0.406655
H  3.497776 -1.675903 1.580773
H  -4.615315 -0.080644 1.913742
H  -2.960477 2.90441 -0.794954
H  -2.273729 -2.552923 0.738527
H  -1.195206 2.245383 -2.086986
H  4.592576 2.190053 -0.563614
H  5.852179 -1.023548 1.698406
H  4.837512 -0.089053 2.870598
H  6.39498 0.600475 2.271381
H  -5.367758 2.199332 1.710019
