program: Gaussian 09
title: 000153335
version: EM64L-G09RevD.01
frameworkgroup: C1[X(C18H21NO9S)]
method: RPBEPBE
basis: SDD
operation: Freq
keyword: #p
keyword: freq=noraman
keyword: PBEPBE/SDD
title: #p freq=noraman PBEPBE/SDD
converged: YES YES NO NO
title: Mulliken charges:
elementType: S O O O O O O O O O N C C C C C C C C C C C C C C C C C C H H H H H H H H H H H H H H H H H H H H H
charge: 1.170097 -0.245459 -0.343805 -0.445478 -0.400852 -0.238861 -0.413918 -0.569129 -0.492947 -0.490857 -0.590181 -0.562272 -0.479484 0.565759 0.238932 -0.004621 0.250300 0.211090 -0.569540 -0.471728 0.439732 -0.624449 -0.547586 0.183436 -0.219603 -0.330168 0.190017 -0.352863 -0.538848 0.224544 0.230392 0.263700 0.261789 0.224710 0.233064 0.253682 0.272710 0.224746 0.215210 0.239406 0.273657 0.240326 0.351564 0.373383 0.383817 0.351401 0.246495 0.217299 0.218910 0.382480
chargesum: 0.00000
title: Mulliken charges with hydrogens summed into heavy atoms:
elementType: S O O O O O O O O O N C C C C C C C C C C C C C C C C C C
charge: 1.170097 -0.245459 -0.343805 -0.072095 -0.017035 -0.238861 -0.062517 -0.186649 -0.492947 -0.490857 -0.238617 -0.107336 0.046005 0.565759 0.238932 -0.004621 0.250300 0.211090 -0.344830 -0.238664 0.439732 -0.370767 -0.274876 0.183436 0.220353 -0.090762 0.190017 0.161120 0.143856
polarizability: 3.97772080e+02 2.10765843e+01 2.60352286e+02 7.34643135e+00 1.63124643e+00 1.94943848e+02
1716.lowfreq: -5.2092 -0.0013 -0.0008 0.0010 1.6562 2.8033 4.3558 9.5024 15.2636
frequency: 3.7695 8.6345 15.2377 19.3197 21.1308 25.4811 37.5274 52.6496 73.7200 90.2129 95.4353 121.5391 126.1948 131.0459 138.2206 150.1677 187.6934 192.7161 211.4080 213.6889 222.5753 237.2889 242.7186 260.7747 273.4557 280.5464 291.4389 294.7971 305.7426 324.6264 340.7262 343.1067 348.6099 354.5552 364.4940 396.2721 409.3000 414.7437 429.4892 435.1782 453.3608 479.6640 486.4642 506.7768 522.5564 541.3796 550.8254 563.2323 580.2297 599.2395 604.3814 629.0749 633.6046 652.1585 701.7415 711.7251 724.6198 726.3668 731.4990 782.3593 789.1597 806.5729 810.0044 840.2109 842.9708 849.1745 866.3403 914.6835 918.3815 945.1739 971.1379 984.9152 986.4361 993.8500 1003.2958 1022.2503 1032.1063 1034.8688 1042.9488 1067.6494 1088.4476 1090.2448 1099.4082 1112.1481 1137.6541 1148.7506 1153.9508 1170.9319 1177.6978 1180.0349 1217.0307 1225.6246 1226.6438 1228.6457 1265.7925 1267.3188 1276.8763 1281.5201 1293.6193 1312.3060 1346.4776 1354.7692 1375.4298 1386.8509 1397.3050 1397.7147 1397.9785 1416.5581 1420.2799 1425.9697 1436.6805 1455.4061 1467.1021 1467.6478 1468.9613 1472.6108 1495.5496 1517.2667 1561.2625 1584.8903 1597.2503 1622.8481 1644.3217 2471.7110 2954.2698 2964.5207 2990.8988 2994.5917 3008.4603 3028.7599 3034.1954 3039.9897 3069.4039 3073.6825 3093.6558 3124.0555 3128.4087 3151.1409 3160.8361 3190.4647 3489.1975 3507.2533 3567.5159 3571.9775
redmass: 4.6338 9.2929 7.6526 6.6049 6.5750 6.5946 5.4012 5.1218 5.0758 4.5198 5.6091 4.3493 4.8836 3.2182 3.1396 4.8761 3.2723 2.3332 3.9277 5.0883 2.6375 3.2762 1.4064 2.8860 3.4009 3.5682 3.5447 4.7342 4.8305 4.5166 5.9871 2.4038 2.3687 2.7935 2.4750 6.2459 5.1494 1.1464 4.0213 4.4717 3.2101 6.1823 4.5229 4.2803 7.6013 13.0668 2.7428 6.8730 5.3176 3.7072 4.2243 4.1770 3.1259 4.2706 4.1636 3.7759 2.8334 2.7220 5.3975 1.6873 2.2571 1.6096 1.8469 2.6340 2.4689 1.9766 4.6344 2.0831 1.3942 3.2014 5.5263 5.6016 8.0746 4.2153 2.0904 3.5151 1.2167 1.0671 4.0996 3.5130 2.3130 2.7967 2.3267 1.2609 1.3647 1.2385 2.4032 1.1915 1.4566 1.5466 1.1737 1.5511 1.8617 2.5013 1.1991 1.1233 2.6196 2.1717 1.4344 2.4892 1.9459 1.2877 2.0337 2.0458 2.1922 3.3423 1.5340 2.6216 4.2427 1.9561 1.1781 1.0728 1.0504 1.1257 1.0934 1.0626 3.2155 2.9172 3.2165 4.0473 6.7911 6.8663 4.2562 1.0772 1.0332 1.0559 1.0643 1.0626 1.0611 1.1068 1.0960 1.1037 1.1016 1.0986 1.0908 1.0983 1.0893 1.0924 1.0942 1.0917 1.0662 1.0774 1.0658 1.0659
irintensity: 0.1579 1.1815 0.8397 1.5919 2.3611 0.7734 1.1748 0.3595 0.8882 3.9925 3.1517 4.4067 12.1689 2.6061 19.6205 5.8192 7.8744 25.3609 3.1636 2.1150 18.3641 8.2220 0.9017 7.4704 5.2823 11.7790 49.1426 34.8433 8.7236 11.5624 6.2549 28.3373 46.7607 93.7668 34.3012 23.7350 16.4156 103.5063 27.4882 11.5833 14.1600 4.2862 25.8245 7.2409 5.5725 281.1982 1.1687 12.4808 21.8358 0.6353 3.6072 19.6795 9.6877 11.0073 16.3606 45.6309 10.9810 8.0313 15.1016 0.9448 16.9475 9.8825 18.5201 23.1875 52.3375 39.7524 59.1482 17.2705 0.6456 12.8036 78.7072 75.7139 27.3839 30.7646 9.4499 91.5849 111.9786 120.7742 49.0036 14.5948 186.5956 53.1652 3.5152 0.1955 15.0205 3.2967 439.7589 41.9666 93.4136 21.6265 35.5593 122.3364 261.0686 74.6174 15.8782 6.6866 44.5992 123.7168 16.8550 158.7773 121.0809 1.4514 63.0160 36.8849 17.7341 9.8021 7.9189 65.6647 51.3557 69.6224 9.8934 20.4215 13.2682 54.4952 11.7250 49.1110 105.1910 145.9222 67.9207 248.3826 34.3335 8.2579 889.5339 568.0410 76.4419 26.8939 41.6976 19.7683 16.9478 32.3040 0.3279 52.6225 14.9089 6.4749 19.3816 32.0439 7.1867 1.6110 13.7997 4.8316 52.5378 42.5277 47.1841 29.3012
temp: 298.150 k
press: 1.00000 atm
elementType: 16 8 8 8 8 8 8 8 8 8 7 6 6 6 6 6 6 6 6 6 6 6 6 6 6 6 6 6 6 1 1 1 1 1 1 1 1 1 1 1 1 1 1 1 1 1 1 1 1 1
symmnumber: 1
zpe: 972985.0 jmol-1
zpe.correction: 0.370590 hartree
zpe.thermalcorrener: 0.401012 hartree
zpe.thermalcorrenthalpy: 0.401956 hartree
zpe.thermalcorrgfe: 0.301978 hartree
zpe.sumelectzpe: -1825.948914 hartree
zpe.sumelectthermal: -1825.918492 hartree
zpe.sumelectthermalent: -1825.917548 hartree
zpe.sumelectthermalfe: -1826.017527 hartree
dipole: 3.5590 0.4835 -2.1377
dipole: 4.1797
quadrupole: -154.9017 -195.5608 -169.5132
quadrupole: 18.9726 11.2391 3.5554
quadrupole: 18.4235 -22.2355 3.8120 18.9726 11.2391 3.5554
hfenergy: -1826.3195042 hartree
pointgroup: C01 [X(C18H21N1O9S1)]
dipole: -1.4384977 0.3630785 0.7092393 debye
polarizability: 397.290368|-14.2737796|254.4848021|20.6225795|-17.7714284|201.2930433 unknown
InChI: InChI=1S/C18H21NO9S/c1-27-17-5-3-11(8-14(17)21)2-4-13(20)18-15(22)9-12(10-16(18)23)28-7-6-19-29(24,25)26/h3,5,8-10,19,21-24H,2,4,6-7H2,1H3
charge 0 multiplicity 1
50 atoms
S  -7.736706 -2.202094 -0.182559
O  -4.395164 0.247226 0.154615
O  1.342354 2.707845 -1.376468
O  0.241401 -0.889263 0.587205
O  -1.038525 3.282308 -1.600246
O  7.959571 -2.125531 0.937584
O  6.668024 -2.619401 -1.35904
O  -9.502904 -1.586625 -0.091896
O  -7.206029 -2.402127 1.322843
O  -7.659845 -3.364549 -1.29009
N  -7.018403 -0.745823 -0.848087
C  3.646666 1.350134 -0.732394
C  2.281198 0.736104 -0.3382
C  4.803865 0.473886 -0.276326
C  1.095759 1.585375 -0.762888
C  -0.301939 1.209361 -0.514755
C  -0.740233 0.008846 0.144239
C  -1.349797 2.11374 -0.962759
C  5.201038 -0.654487 -1.041644
C  5.493744 0.732386 0.928549
C  -3.08092 0.636236 -0.10751
C  -2.096219 -0.279838 0.34742
C  -2.721302 1.829868 -0.759738
C  6.246978 -1.500397 -0.621681
C  -5.478527 1.115076 -0.320084
C  6.545585 -0.109347 1.364503
C  6.933703 -1.232831 0.600804
C  -6.799895 0.421318 0.022296
C  8.687097 -1.860021 2.179012
H  3.67124 1.496734 -1.828036
H  3.729413 2.358384 -0.289346
H  2.230306 0.569925 0.755354
H  2.167504 -0.279771 -0.76254
H  4.689598 -0.871137 -1.991043
H  5.216427 1.602277 1.535276
H  -2.425181 -1.198109 0.845265
H  -3.445587 2.56335 -1.118553
H  -5.436458 2.094522 0.199084
H  -5.379988 1.285624 -1.411071
H  7.061971 0.122717 2.300872
H  -6.755374 0.063525 1.066255
H  -7.630594 1.150117 -0.059444
H  -7.284803 -0.611053 -1.830624
H  -0.177171 -1.674377 1.021832
H  0.018118 3.313345 -1.654529
H  6.13372 -2.696834 -2.188807
H  9.434603 -2.663886 2.247263
H  8.015173 -1.899071 3.059321
H  9.197369 -0.877056 2.146877
H  -10.071664 -2.307495 0.306491
