program: Gaussian 09
title: 000153320
version: EM64L-G09RevD.01
frameworkgroup: C1[X(C18H20O3)]
method: RPBEPBE
basis: SDD
operation: Freq
keyword: #pfreq=noraman
keyword: PBEPBE/SDD
title: #p freq=noraman PBEPBE/SDD
converged: YES YES NO NO
title: Mulliken charges:
elementType: O O O C C C C C C C C C C C C C C C C C C H H H H H H H H H H H H H H H H H H H H
charge: -0.321827 -0.433437 -0.434691 0.159647 0.157408 -0.464272 -0.463638 0.376285 0.375022 -0.707867 -0.707870 -0.394137 -0.393474 -0.370482 -0.368776 -0.391904 -0.353191 -0.344419 -0.383211 0.278045 0.277445 0.238950 0.205877 0.239920 0.206260 0.234819 0.228121 0.214929 0.234570 0.227625 0.215873 0.230869 0.231979 0.277362 0.275783 0.218095 0.249818 0.251301 0.219971 0.353081 0.354142
chargesum: 0.00000
title: Mulliken charges with hydrogens summed into heavy atoms:
elementType: O O O C C C C C C C C C C C C C C C C C C
charge: -0.321827 -0.080356 -0.080549 0.159647 0.157408 -0.019446 -0.017458 0.376285 0.375022 -0.029998 -0.029803 -0.163268 -0.161495 -0.093119 -0.092993 -0.173808 -0.103373 -0.093118 -0.163240 0.278045 0.277445
polarizability: 2.97786788e+02 1.41897416e+01 1.42928003e+02 -4.06929266e+00 -1.73729473e-01 1.78220612e+02
1716.lowfreq: -9.3749 -3.1975 0.0004 0.0008 0.0009 6.3506 32.7053 34.6099 37.8114
frequency: 32.7044 34.5444 37.8017 43.3693 59.8701 73.0700 78.7609 144.1914 152.0518 175.4642 175.6781 190.1318 200.4475 227.7483 262.0415 316.1695 329.9278 346.3190 358.6845 360.1978 362.3903 376.6190 379.0589 411.2658 411.6025 432.8574 452.8730 491.1313 509.3389 529.2336 545.4088 604.0071 628.0949 629.7879 634.9828 686.7754 727.8485 733.9547 751.9819 774.5854 799.6576 804.2848 805.3377 814.7175 829.3188 836.3701 853.0875 857.6546 927.5275 933.6605 942.7848 953.3178 964.4082 978.8077 1002.0642 1003.6553 1012.9329 1068.0563 1078.3923 1081.3933 1097.7207 1103.5321 1106.0870 1110.3768 1142.9356 1144.7802 1175.3079 1178.4902 1232.5158 1240.3836 1242.7706 1245.6891 1250.6562 1292.6449 1303.1509 1307.2221 1316.5724 1331.0540 1363.3022 1383.7862 1384.3379 1387.2564 1388.6541 1418.7589 1419.5019 1463.0938 1463.5707 1474.4480 1474.5852 1487.9435 1488.2248 1501.8758 1502.3879 1592.1973 1593.0297 1623.7825 1625.5936 2984.8835 2985.1741 2986.9075 2987.8518 3058.1355 3058.3233 3082.3918 3082.7580 3089.8029 3089.9618 3111.4199 3113.3831 3128.5709 3138.3789 3151.7422 3160.2562 3169.9788 3173.2534 3581.9478 3582.1793
redmass: 4.1510 3.8075 4.6019 5.1823 2.8803 3.6745 2.5364 3.3799 4.4943 2.8626 4.0049 2.2858 1.4165 1.6386 2.4585 2.9657 3.2948 5.0065 1.1323 3.9267 1.2833 3.8197 4.2803 2.9586 2.9653 4.1077 3.9866 3.5023 3.2207 4.0381 3.1163 4.9114 6.0105 5.2455 5.6291 4.1428 3.6786 2.6769 2.8986 1.3338 2.4324 5.4722 1.4283 1.4077 1.6168 1.8861 2.4390 2.5509 1.5677 2.0161 1.7828 1.5994 1.3563 1.3524 2.8569 2.7737 2.3523 1.8075 1.9191 2.6360 1.7946 1.6583 1.5859 1.6902 1.3661 1.3566 1.1071 1.1110 1.7043 1.4368 2.4093 2.4605 3.4312 1.8199 1.3378 1.4921 1.8607 1.4378 2.5291 4.2398 3.5494 1.2699 1.3781 3.2438 3.2176 1.0792 1.0802 1.0416 1.0414 1.0582 1.0605 2.7848 2.8247 6.5585 6.6024 6.3655 6.4516 1.0442 1.0427 1.0553 1.0576 1.0955 1.0955 1.0994 1.0994 1.1007 1.1006 1.0876 1.0898 1.0893 1.0959 1.0882 1.0939 1.0954 1.0967 1.0660 1.0660
irintensity: 1.3752 0.1867 0.8286 0.0723 0.1438 0.0982 0.5612 0.4648 0.0167 1.5591 0.5255 0.9675 0.0324 1.7029 1.1408 1.0402 1.1805 6.0660 128.8833 12.9301 139.6248 17.2467 3.9925 1.2977 0.0730 6.6847 8.4666 1.8105 19.1662 39.0778 4.3988 48.3886 2.5146 1.8624 1.8652 3.8447 0.0398 11.2867 14.1317 0.1989 4.9194 0.7467 27.9869 35.5675 52.5113 47.2114 37.0092 10.2115 5.5143 10.5978 1.3746 0.8704 1.3266 0.5179 0.8556 10.7996 0.5319 6.4881 7.8604 13.3368 17.9523 59.0102 12.7806 21.0305 490.7291 17.1260 17.3215 6.4204 3.8686 2.1850 2.9101 47.8054 0.8882 56.2893 21.4746 13.7339 0.2481 19.1339 8.6229 10.2282 35.1351 18.7394 8.8355 5.9868 11.8359 2.9557 4.1776 5.5224 10.0686 20.8894 2.3963 48.1733 141.3830 4.5292 17.8342 9.5024 73.3507 29.9830 33.6896 29.6392 8.2005 3.6111 1.2136 30.0592 46.8132 23.5958 54.4080 22.0072 22.4584 10.6761 14.7620 1.7523 3.8730 6.9419 6.4590 68.2452 23.9111
temp: 298.150 k
press: 1.00000 atm
elementType: 8 8 8 6 6 6 6 6 6 6 6 6 6 6 6 6 6 6 6 6 6 1 1 1 1 1 1 1 1 1 1 1 1 1 1 1 1 1 1 1 1
symmnumber: 1
zpe: 872053.3 jmol-1
zpe.correction: 0.332148 hartree
zpe.thermalcorrener: 0.352799 hartree
zpe.thermalcorrenthalpy: 0.353743 hartree
zpe.thermalcorrgfe: 0.281907 hartree
zpe.sumelectzpe: -922.017078 hartree
zpe.sumelectthermal: -921.996427 hartree
zpe.sumelectthermalent: -921.995483 hartree
zpe.sumelectthermalfe: -922.067318 hartree
dipole: 0.4013 0.8991 1.8464
dipole: 2.0925
quadrupole: -115.7622 -125.7044 -116.9209
quadrupole: 2.6852 -20.7358 -0.7311
quadrupole: 3.7003 -6.2419 2.5416 2.6852 -20.7358 -0.7311
hfenergy: -922.3492259 hartree
pointgroup: C01 [X(C18H20O3)]
dipole: -0.1644061 0.3581047 -0.7228474 debye
polarizability: 297.7784021|-13.8051394|142.8626329|-5.1034356|0.0428302|178.2943676 unknown
InChI: InChI=1S/C18H20O3/c1-3-17(13-5-9-15(19)10-6-13)18(4-2,21-17)14-7-11-16(20)12-8-14/h5-12,19-20H,3-4H2,1-2H3
charge 0 multiplicity 1
41 atoms
O  0.006665 -0.01043 1.639831
O  6.083488 -0.411253 -0.698702
O  -6.079101 0.360029 -0.766751
C  0.506555 0.572888 0.329005
C  -0.508228 -0.579047 0.328551
C  0.044418 2.009495 0.080664
C  -0.049181 -2.012687 0.057566
C  1.963912 0.30073 0.040089
C  -1.968862 -0.304634 0.060627
C  0.730095 3.015989 1.03232
C  -0.725671 -3.031141 1.003045
C  2.499564 0.552837 -1.247677
C  -2.521241 -0.536152 -1.227415
C  2.832476 -0.183709 1.051789
C  -2.823856 0.15754 1.08952
C  3.863852 0.321007 -1.526089
C  -3.8860 -0.305943 -1.487515
C  4.197606 -0.41265 0.791199
C  -4.195465 0.385878 0.846079
C  4.713341 -0.160716 -0.500575
C  -4.724929 0.15379 -0.445857
H  -1.050892 2.064562 0.203331
H  0.263144 2.279535 -0.971857
H  1.0472 -2.070013 0.168993
H  -0.278724 -2.269207 -0.996064
H  0.506876 2.762012 2.083877
H  1.827355 3.01073 0.904647
H  0.367343 4.041923 0.840491
H  -0.491992 -2.790633 2.055519
H  -1.824059 -3.024948 0.88551
H  -0.364286 -4.054282 0.794774
H  1.850924 0.927015 -2.048303
H  -1.880058 -0.894199 -2.04146
H  2.417397 -0.379651 2.045434
H  -2.397688 0.337681 2.08143
H  4.260069 0.515128 -2.5316
H  -4.316484 -0.47609 -2.478769
H  4.873435 -0.781726 1.568303
H  -4.845112 0.740208 1.657429
H  6.34927 -0.204012 -1.628818
H  -6.583255 0.675546 0.023829
