program: Gaussian 09
title: 000153250
version: EM64L-G09RevD.01
frameworkgroup: C1[X(C3H7N2O)]
method: RPBEPBE
basis: SDD
operation: Freq
keyword: #p
keyword: freq=noraman
keyword: PBEPBE/SDD
title: #p freq=noraman PBEPBE/SDD
converged: YES YES NO NO
title: Mulliken charges:
elementType: O N N C C C H H H H H H H
charge: -0.096408 -0.025184 0.203854 -0.363331 -0.326723 -0.538763 0.317648 0.317721 0.312332 0.312397 0.304020 0.291092 0.291344
chargesum: 1.00000
title: Mulliken charges with hydrogens summed into heavy atoms:
elementType: O N N C C C
charge: -0.096408 -0.025184 0.203854 0.272038 0.298006 0.347693
polarizability: 6.25774718e+01 -2.60919721e+00 4.69510884e+01 -1.27285649e-02 3.33341102e-03 3.20183313e+01
1716.lowfreq: -16.3161 -7.0185 -0.0009 -0.0006 -0.0002 14.3511 104.7029 137.1412 264.1593
frequency: 104.6514 137.1366 264.1556 333.3250 488.7589 593.2147 717.7967 768.3238 832.0770 839.1808 998.3447 1016.2481 1070.1449 1076.7272 1106.9954 1153.2233 1209.7891 1218.9655 1268.1440 1326.8323 1391.1508 1444.6940 1448.8464 1460.9460 1475.5663 1496.8646 3012.9474 3040.8743 3083.7374 3109.8783 3112.5271 3154.2367 3173.1262
redmass: 1.8795 1.0923 3.5075 2.8025 5.1956 4.9825 9.5089 8.6583 1.1695 4.6697 2.9864 6.6197 1.3476 1.9391 1.2292 1.2930 4.1921 1.1226 1.7999 1.3393 1.5475 1.1718 1.0409 1.1395 1.1343 1.3592 1.0330 1.0591 1.0586 1.1090 1.1044 1.1041 1.1144
irintensity: 2.0164 0.1456 1.9104 6.2947 3.2971 10.5480 8.7879 7.4387 3.6755 0.7573 25.5846 40.1605 0.0748 39.0881 3.2327 1.4246 15.7723 1.9363 63.8725 8.7704 1.5776 18.5164 40.4108 0.3847 23.1797 66.1545 3.6001 1.6273 0.6930 0.1507 0.0219 2.3162 0.3970
temp: 298.150 k
press: 1.00000 atm
elementType: 8 7 7 6 6 6 1 1 1 1 1 1 1
symmnumber: 1
zpe: 280700.3 jmol-1
zpe.correction: 0.106913 hartree
zpe.thermalcorrener: 0.112974 hartree
zpe.thermalcorrenthalpy: 0.113918 hartree
zpe.thermalcorrgfe: 0.077227 hartree
zpe.sumelectzpe: -302.414597 hartree
zpe.sumelectthermal: -302.408536 hartree
zpe.sumelectthermalent: -302.407592 hartree
zpe.sumelectthermalfe: -302.444283 hartree
dipole: -1.4340 3.8495 -0.0031
dipole: 4.1079
quadrupole: -18.6101 -31.2030 -31.2036
quadrupole: 3.0245 -0.0046 0.0055
quadrupole: 8.3955 -4.1975 -4.1980 3.0245 -0.0046 0.0055
hfenergy: -302.52151 hartree
pointgroup: C01 [X(C3H7N2O1)]
dipole: 0.6517386 -1.4749536 0.1085997 debye
dipolederiv: -0.866506 0.1908196 0.0135076 -0.319347 -0.0506307 0.0079719 0.063074 -0.0141223 -0.1094156 -0.1914523 0.0856696 -0.004068 0.5101818 -0.0882932 -0.021292 -0.0407143 -0.004344 -0.0842822 0.9920869 -0.4024747 -0.0020094 -0.332746 0.1956942 -0.0000842 -0.0110568 0.003667 0.0440033 -0.1788116 -0.0400233 0.0212737 0.0376671 0.0595912 0.0139651 0.0123046 0.0174089 0.2314862 0.2057768 0.1276505 -0.0078317 0.1700399 0.1493777 0.0068395 -0.0113281 0.0090489 0.2885144 0.2660101 0.0199232 -0.0069119 0.0449449 -0.0036376 0.0120168 -0.0112443 0.0138184 0.1436 0.1146068 0.0001983 -0.059709 0.0156178 0.1224498 -0.0003605 -0.0381726 0.0247564 0.0550349 0.1229547 0.0091271 0.0533077 0.0213856 0.1157192 -0.0136221 0.0292771 -0.0376995 0.0554465 0.1233293 -0.0043366 -0.02623 -0.0477072 0.1034919 0.007783 -0.0280995 -0.0199961 0.0566416 0.127733 0.0008095 0.0207759 -0.0424727 0.1052572 -0.0133167 0.0304573 0.0107935 0.052606 0.1032662 0.0411749 -0.0012259 -0.0044631 0.0436575 0.0126881 0.0035338 0.0103804 0.168293 0.0887689 -0.0205942 -0.0367002 -0.0306085 0.1096938 -0.085592 -0.0049141 -0.0680486 0.0648044 0.0922372 -0.0079437 0.0358214 -0.0224926 0.1376289 0.0730031 0.0068828 0.0543371 0.0332677 unknown
polarizability: 62.7750682|-1.7849063|46.584744|-1.1390412|-1.2868831|32.1870792 unknown
InChI: InChI=1S/C3H7N2O/c1-5-2-3-6-4-5/h2-3H2,1H3
charge 1 multiplicity 1
13 atoms
O  -1.29815 0.836966 -0.010299
N  0.730312 -0.003905 -0.020398
N  0.03719 1.105612 -0.093308
C  -0.090664 -1.263432 0.135275
C  -1.529387 -0.698838 0.139098
C  2.207933 0.035027 -0.088081
H  0.195922 -1.759569 1.077177
H  0.12237 -1.933905 -0.713368
H  -2.145274 -0.980949 -0.725694
H  -2.075938 -0.815231 1.084804
H  2.530348 1.079466 -0.205237
H  2.545509 -0.565749 -0.949431
H  2.623028 -0.389193 0.841662
