program: Gaussian 09
title: 000153235
version: EM64L-G09RevD.01
frameworkgroup: C1[X(C11H14O2)]
method: RPBEPBE
basis: SDD
operation: Freq
keyword: #pfreq=noraman
keyword: PBEPBE/SDD
title: #p freq=noraman PBEPBE/SDD
converged: YES YES NO NO
title: Mulliken charges:
elementType: O O C C C C C C C C C C C H H H H H H H H H H H H H H
charge: -0.285794 -0.271713 0.464440 0.332391 -0.448682 -0.392109 -0.409612 -0.393097 -0.243886 -0.229211 -0.250182 -0.523661 -0.498933 0.211940 0.195092 0.216013 0.219784 0.286999 0.220812 0.219019 0.223910 0.262040 0.210422 0.237483 0.239645 0.208161 0.198730
chargesum: 0.00000
title: Mulliken charges with hydrogens summed into heavy atoms:
elementType: O O C C C C C C C C C C C
charge: -0.285794 -0.271713 0.464440 0.332391 -0.236742 0.018996 -0.189828 -0.106098 -0.023074 -0.010192 -0.026272 0.186283 0.147603
polarizability: 2.23287234e+02 8.87491284e+00 1.28245990e+02 6.96211678e+00 -5.56603406e+00 6.89682435e+01
1716.lowfreq: -11.1896 -1.1474 -0.0008 -0.0005 0.0004 6.3057 40.2699 48.5651 70.3071
frequency: 40.2476 48.4118 70.2656 105.2466 118.2687 136.3863 179.9092 195.5441 223.8880 249.7097 291.0196 311.9100 335.4397 390.6894 408.5289 501.4750 553.7972 598.1865 615.3257 698.5441 699.7284 759.8036 767.1143 828.8911 846.7838 857.6911 880.0003 927.8013 978.2113 985.1624 990.4102 996.6787 1017.7755 1027.3137 1031.6687 1087.3837 1110.8854 1111.6392 1137.6388 1151.8029 1169.9310 1189.3621 1192.1803 1197.9447 1242.1566 1324.8584 1356.3375 1361.0236 1387.8178 1431.9990 1437.1049 1442.9967 1457.1005 1459.5767 1469.3444 1476.8226 1481.3781 1485.9057 1577.0233 1610.2620 1657.6412 2915.6255 2926.1047 2968.9138 2997.5688 3001.2549 3071.7928 3107.5185 3108.9851 3118.3918 3121.7252 3122.6440 3136.3140 3156.8357 3190.0478
redmass: 3.3337 4.1840 2.9372 3.6522 2.8396 2.9183 2.3815 1.3960 1.4270 3.8625 3.5103 3.6345 2.8970 3.6310 2.8519 3.1589 3.6636 4.7688 6.3944 5.1795 1.7122 3.2299 2.0692 1.9571 2.0470 1.6209 2.9279 1.5258 1.3745 3.7231 2.2936 1.3237 7.0065 3.0403 3.8448 1.6819 1.2635 1.2449 1.4975 1.3878 1.0620 1.1859 1.1368 1.6861 2.7260 1.4442 1.7857 1.3701 3.5299 1.1803 1.7788 1.3621 1.0560 1.0765 1.0666 1.0626 2.2580 1.0653 5.7521 5.9828 7.6530 1.0601 1.0380 1.0337 1.0969 1.1014 1.1008 1.0972 1.0870 1.0885 1.1025 1.0872 1.0937 1.0998 1.0942
irintensity: 1.5861 1.3623 3.6892 2.0247 6.5490 3.7270 2.3077 1.1097 5.6598 0.3500 1.0113 0.7133 2.3918 3.2448 0.0146 10.7121 8.8784 8.7708 0.1758 2.4338 53.5586 8.5530 22.8587 53.5187 6.8084 14.1713 2.0773 16.8945 0.0811 3.9612 6.1572 1.3974 147.3234 19.8241 81.7331 7.3572 0.5109 9.9577 35.2757 2.4501 2.0074 8.1788 6.7975 145.6348 9.5497 22.1572 111.9389 41.2073 5.9070 7.6906 3.5331 16.5061 11.4868 14.1320 3.3276 27.5778 22.0521 11.6807 1.1634 14.0296 60.6447 35.6205 122.8247 103.4559 96.1483 14.7612 29.4646 26.3787 6.0506 19.8028 14.4059 0.8184 44.0358 39.5976 5.3490
temp: 298.150 k
press: 1.00000 atm
elementType: 8 8 6 6 6 6 6 6 6 6 6 6 6 1 1 1 1 1 1 1 1 1 1 1 1 1 1
symmnumber: 1
zpe: 583895.3 jmol-1
zpe.correction: 0.222394 hartree
zpe.thermalcorrener: 0.235799 hartree
zpe.thermalcorrenthalpy: 0.236743 hartree
zpe.thermalcorrgfe: 0.181496 hartree
zpe.sumelectzpe: -576.982575 hartree
zpe.sumelectthermal: -576.969171 hartree
zpe.sumelectthermalent: -576.968227 hartree
zpe.sumelectthermalfe: -577.023473 hartree
dipole: 3.5395 -0.1819 1.6905
dipole: 3.9267
quadrupole: -60.1285 -67.7200 -83.1570
quadrupole: 0.1324 5.0144 -1.6517
quadrupole: 10.2067 2.6151 -12.8218 0.1324 5.0144 -1.6517
hfenergy: -577.2049694 hartree
pointgroup: C01 [X(C11H14O2)]
dipole: 1.4067536 -0.5272973 -0.3601133 debye
polarizability: 222.9828966|-9.2902301|79.8480505|7.4943942|-23.967581|117.6705207 unknown
InChI: InChI=1S/C11H14O2/c1-12-9-11(13-2)8-10-6-4-3-5-7-10/h3-8H,9H2,1-2H3
charge 0 multiplicity 1
27 atoms
O  1.071902 -0.871654 1.108597
O  3.401459 0.758731 -0.048124
C  -1.310206 0.045799 -0.508128
C  1.21888 -0.335538 -0.181382
C  0.109823 0.081467 -0.877504
C  2.598457 -0.243463 -0.786113
C  -2.260127 0.532765 -1.457872
C  -1.806512 -0.446657 0.737883
C  -3.641859 0.528791 -1.183317
C  -3.19106 -0.450017 1.007992
C  -4.117655 0.034873 0.054806
C  2.254799 -1.409978 1.800982
C  4.755514 0.86673 -0.595818
H  0.32449 0.514967 -1.862656
H  3.125173 -1.225209 -0.74703
H  2.504722 0.053542 -1.850005
H  -1.900524 0.918544 -2.420801
H  -1.095259 -0.816581 1.478769
H  -4.347772 0.909523 -1.930509
H  -3.551139 -0.831991 1.970694
H  -5.191641 0.030115 0.27276
H  3.091711 -0.691777 1.759574
H  2.555145 -2.384622 1.369575
H  1.928826 -1.558752 2.841468
H  5.273152 1.62474 0.012175
H  4.738715 1.195326 -1.656591
H  5.303585 -0.098575 -0.530226
