program: Gaussian 09
title: 000153230
version: EM64L-G09RevD.01
frameworkgroup: C1[X(C12H8N4O3S)]
method: RPBEPBE
basis: SDD
operation: Freq
keyword: #p
keyword: freq=noraman
keyword: PBEPBE/SDD
title: #p freq=noraman PBEPBE/SDD
converged: YES YES NO NO
title: Mulliken charges:
elementType: S O O O N N N N C C C C C C C C C C C C H H H H H H H H
charge: 0.317925 -0.273057 -0.204551 -0.204553 -0.182478 0.010062 0.066305 0.027553 -0.006320 -0.187409 0.023674 0.370128 -0.130424 -0.038814 -0.346370 -0.346372 -0.747459 -0.345640 -0.345644 0.376497 0.330623 0.253625 0.253631 0.249760 0.250929 0.250925 0.288727 0.288726
chargesum: 0.00000
title: Mulliken charges with hydrogens summed into heavy atoms:
elementType: S O O O N N N N C C C C C C C C C C C C
charge: 0.317925 -0.273057 -0.204551 -0.204553 -0.182478 0.010062 0.066305 0.027553 -0.006320 -0.187409 0.023674 0.370128 0.200199 -0.038814 -0.092744 -0.092741 0.004155 -0.056913 -0.056918 0.376497
polarizability: 3.29480280e+02 7.83358439e+00 1.59624342e+02 -1.25402969e-02 4.07873755e-02 1.28401056e+02
1716.lowfreq: -56.0594 -1.3804 -0.6742 -0.0023 -0.0021 0.0011 6.1422 35.5399 39.7619
frequency: -56.0550 35.5359 39.7213 59.0656 104.5162 123.8653 127.5141 147.3534 148.2283 199.5153 207.7239 215.8042 259.6761 289.6169 311.6114 334.8357 400.2262 400.7304 430.1303 457.9106 469.7584 508.4257 509.4226 509.7924 541.1765 581.0992 616.2480 620.3355 670.2707 684.8795 686.0400 736.7048 746.8959 783.9429 816.0906 836.1173 841.6688 848.2047 867.4177 981.7984 986.3848 987.7497 991.3176 1008.6615 1046.8035 1091.3423 1107.9259 1123.2076 1132.8322 1166.4363 1182.7912 1220.0406 1221.0795 1261.0749 1295.2912 1305.5112 1313.8629 1360.1709 1362.9085 1387.0535 1390.5433 1406.3315 1408.9202 1447.1719 1456.9167 1467.3565 1514.9180 1592.5316 1599.2651 1614.7494 2987.1199 3068.6691 3097.2146 3158.1607 3159.5136 3185.8728 3188.5828 3235.8650
redmass: 4.7151 9.9023 5.8485 11.2250 7.4073 2.1759 9.1076 1.5682 7.8010 8.4494 8.6368 8.0814 4.4232 5.3723 6.0206 7.0625 2.8806 9.0595 7.3646 11.4167 4.6488 5.1912 4.8657 8.1183 8.5826 5.8530 6.8125 7.2265 4.3644 8.2208 7.9563 10.5492 4.8815 9.3197 7.0154 6.2609 1.3353 1.2425 1.8976 2.6771 1.5012 2.1694 1.3756 3.0681 1.4082 3.5074 1.3148 3.4235 2.8010 2.6298 1.3049 8.3632 6.1418 11.8293 1.2720 3.9509 10.9910 6.1441 7.1455 8.4889 11.0528 3.9715 1.2759 3.1086 1.0416 1.0761 5.4689 8.0486 6.3678 6.6326 1.0367 1.0986 1.0987 1.0905 1.0905 1.0952 1.0965 1.0984
irintensity: 0.0000 0.1254 0.2841 0.0234 6.5800 0.0070 6.1783 0.1379 5.4268 0.6359 1.8821 2.3755 0.8893 1.0755 0.0806 6.3949 0.0376 0.5107 2.1926 0.0301 4.8552 2.7876 8.9081 5.9968 7.1886 1.4032 2.9754 0.4601 20.5652 2.2426 16.8662 0.0007 5.5152 42.8954 3.2596 56.8211 29.3536 0.0016 31.4296 7.3971 0.7720 2.2119 0.0007 13.7668 5.6243 15.6878 16.0116 18.0053 18.3625 39.0853 49.5081 78.8145 367.1345 285.6486 0.1145 20.8062 94.1381 56.6751 29.6399 184.8266 21.2990 71.7140 30.1656 23.5009 19.8780 11.4872 13.4852 1.3956 9.7412 28.6219 18.8329 10.3163 6.3871 5.9110 1.0566 0.0413 4.8820 19.3292
temp: 298.150 k
press: 1.00000 atm
elementType: 16 8 8 8 7 7 7 7 6 6 6 6 6 6 6 6 6 6 6 6 1 1 1 1 1 1 1 1
symmnumber: 1
zpe: 488567.0 jmol-1
zpe.correction: 0.186085 hartree
zpe.thermalcorrener: 0.202394 hartree
zpe.thermalcorrenthalpy: 0.203338 hartree
zpe.thermalcorrgfe: 0.140973 hartree
zpe.sumelectzpe: -1303.251380 hartree
zpe.sumelectthermal: -1303.235071 hartree
zpe.sumelectthermalent: -1303.234127 hartree
zpe.sumelectthermalfe: -1303.296492 hartree
dipole: -9.6997 -1.8424 -0.0035
dipole: 9.8731
quadrupole: -124.0360 -137.8048 -115.7708
quadrupole: 2.6878 0.0194 0.0103
quadrupole: 1.8345 -11.9343 10.0997 2.6878 0.0194 0.0103
hfenergy: -1303.4374651 hartree
pointgroup: C01 [X(C12H8N4O3S1)]
dipole: -3.7969624 -0.8194935 -0.0018172 debye
polarizability: 328.9858956|12.0455277|160.1186308|-0.0176954|0.0671432|128.4011514 unknown
InChI: InChI=1S/C12H8N4O3S/c1-7-6-15-11(14-17)10(13-12(15)20-7)8-2-4-9(5-3-8)16(18)19/h2-6H,1H3
charge 0 multiplicity 1
28 atoms
S  -4.080806 -1.972238 0.001082
O  -2.110409 3.013991 0.003852
O  5.860771 -0.107041 1.140207
O  5.860717 -0.109507 -1.140599
N  -2.713261 0.269592 -0.000207
N  -1.213676 -1.474805 0.000599
N  -1.085785 2.19888 -0.000835
N  5.255978 -0.121792 -0.000167
C  -0.517128 -0.273416 0.000143
C  -2.522888 -1.106637 0.000549
C  -1.412549 0.847786 -0.000246
C  0.967946 -0.220666 0.000045
C  -4.049907 0.704693 -0.000713
C  -4.948008 -0.337085 -0.000113
C  1.680874 -0.202931 1.226345
C  1.680808 -0.205284 -1.226326
C  -6.445386 -0.289389 -0.000384
C  3.088429 -0.169868 1.235131
C  3.088363 -0.172234 -1.235254
C  3.770318 -0.155681 -0.000095
H  -4.262656 1.771419 -0.001515
H  1.130784 -0.215173 2.172216
H  1.130667 -0.219356 -2.172142
H  -6.784357 0.760516 -0.00109
H  -6.871147 -0.782629 0.8924
H  -6.870859 -0.783729 -0.892697
H  3.659643 -0.154127 2.166688
H  3.659526 -0.15829 -2.166871
