program: Gaussian 09
title: 000153188
version: EM64L-G09RevD.01
frameworkgroup: C1[X(C12H12N2OS)]
method: RPBEPBE
basis: SDD
operation: Freq
keyword: #p
keyword: freq=noraman
keyword: PBEPBE/SDD
title: #p freq=noraman PBEPBE/SDD
converged: YES YES NO NO
title: Mulliken charges:
elementType: S O N N C C C C C C C C C C C C H H H H H H H H H H H H
charge: 0.163488 -0.260142 -0.444074 -0.621755 0.583873 -0.243571 0.475733 -0.378053 -0.411628 -0.466260 -0.357284 -0.250908 -0.038807 -0.289266 0.215573 -0.783342 0.226834 0.221245 0.214660 0.306091 0.237519 0.237435 0.299515 0.317631 0.320184 0.257130 0.257276 0.210902
chargesum: 0.00000
title: Mulliken charges with hydrogens summed into heavy atoms:
elementType: S O N N C C C C C C C C C C C C
charge: 0.163488 -0.260142 -0.144559 0.016060 0.583873 -0.243571 0.475733 -0.151218 -0.190383 -0.251600 -0.051193 -0.013389 -0.038807 -0.051832 0.215573 -0.058034
polarizability: 3.78907067e+02 6.26350556e+00 1.58637417e+02 1.89762362e-02 -1.35092512e-01 6.87503600e+01
1716.lowfreq: -5.9005 -2.8588 -0.0009 -0.0006 0.0011 3.5150 21.8654 39.1311 58.9828
frequency: 19.8397 39.1296 58.9703 68.3676 81.4196 91.0042 136.6678 155.1712 169.5512 234.1494 272.9251 291.7553 308.0594 348.4320 378.2768 384.0255 405.2863 417.1031 493.0910 519.7546 540.5109 561.3552 581.3173 593.1098 632.1462 633.5973 642.7956 665.4960 714.4669 732.2446 771.1397 817.6848 827.5794 855.8968 866.8337 917.0980 932.1016 938.5460 990.6751 990.9640 1000.7781 1010.9722 1038.7352 1072.4925 1128.1161 1197.2164 1209.4506 1221.5822 1266.1379 1275.6932 1293.5984 1314.2502 1345.3204 1370.1117 1387.4543 1424.7699 1448.3555 1469.5676 1485.6590 1501.6587 1545.2579 1577.0956 1585.2768 1620.1022 1623.3375 1634.5903 2992.9875 3094.4021 3096.8839 3106.7270 3136.4220 3144.2845 3163.3087 3182.2674 3192.6845 3532.8094 3567.6633 3707.3581
redmass: 5.0715 3.8888 1.2769 3.6320 5.1248 2.8824 1.3389 6.6009 4.2678 5.0282 3.0682 5.4765 1.3776 4.5035 4.0854 4.2331 2.9806 5.1404 3.6540 5.0006 2.8972 3.0351 5.3172 3.2281 6.2576 6.2999 1.1758 6.6516 6.6994 3.2649 1.3521 1.3958 4.9793 1.5691 1.4318 5.4023 6.5816 1.3990 1.6942 1.3263 2.1302 1.9291 1.6213 1.3004 1.4401 1.2489 1.6624 2.6012 1.8265 3.4142 2.3848 1.4345 4.1226 3.6298 1.2185 3.9831 1.0453 1.0950 2.2129 2.9776 5.8969 5.0085 4.8280 4.6604 5.3352 1.2934 1.0362 1.1004 1.0980 1.0876 1.0950 1.0903 1.0893 1.0993 1.0948 1.0763 1.0448 1.1043
irintensity: 0.8457 5.4962 0.2311 8.6873 2.2050 6.8412 8.1152 6.4340 0.2608 2.4567 36.7842 2.9307 281.5906 3.4025 2.6151 11.1045 0.1592 1.5334 37.8109 0.0808 2.6119 1.0791 8.7792 0.0504 0.4403 5.2878 57.9027 12.7501 4.4645 2.5518 76.8235 36.9482 1.1620 67.7880 2.4116 6.9326 5.0601 0.4175 23.9256 3.2480 9.0715 1.4259 14.7914 46.7910 15.7790 0.6890 29.8962 49.6211 41.1827 11.6819 3.2921 33.7235 122.1968 80.5892 64.8505 42.8413 15.0490 26.3281 193.4262 343.7140 551.7978 239.3169 8.1811 170.3809 5.1386 285.0909 20.9419 21.3411 8.4694 32.6110 16.4897 7.1234 18.1208 8.3766 4.3423 11.0453 181.8753 34.8840
temp: 298.150 k
press: 1.00000 atm
elementType: 16 8 7 7 6 6 6 6 6 6 6 6 6 6 6 6 1 1 1 1 1 1 1 1 1 1 1 1
symmnumber: 1
zpe: 562507.5 jmol-1
zpe.correction: 0.214248 hartree
zpe.thermalcorrener: 0.230118 hartree
zpe.thermalcorrenthalpy: 0.231062 hartree
zpe.thermalcorrgfe: 0.169098 hartree
zpe.sumelectzpe: -1046.135824 hartree
zpe.sumelectthermal: -1046.119954 hartree
zpe.sumelectthermalent: -1046.119010 hartree
zpe.sumelectthermalfe: -1046.180973 hartree
dipole: 3.1448 -3.6050 -0.0490
dipole: 4.7842
quadrupole: -60.5993 -93.4604 -108.6333
quadrupole: 17.2141 0.5256 -0.1682
quadrupole: 26.9650 -5.8961 -21.0690 17.2141 0.5256 -0.1682
hfenergy: -1046.3500715 hartree
pointgroup: C01 [X(C12H12N2O1S1)]
dipole: -1.1758999 1.0904435 0.9854001 debye
polarizability: 378.9119272|1.8934305|118.2974929|-6.7898546|44.5755434|109.0854238 unknown
InChI: InChI=1S/C12H12N2OS/c1-8(15)14-10-4-2-9(3-5-10)11-6-7-12(13)16-11/h2-7,14H,13H2,1H3
charge 0 multiplicity 1
28 atoms
S  -3.267248 0.963243 0.886947
O  4.448024 -1.069614 -1.14413
N  3.569042 0.568303 0.293696
N  -5.98433 0.516324 0.554816
C  -0.688863 0.087168 -0.026591
C  -2.137251 -0.072452 -0.132531
C  2.164368 0.370455 0.153619
C  -0.093756 1.074907 0.812354
C  0.196896 -0.751392 -0.768801
C  1.300884 1.213977 0.901971
C  1.593744 -0.62188 -0.690001
C  -2.898994 -0.930732 -0.920342
C  -4.7088 0.142477 0.159723
C  -4.322703 -0.82369 -0.769194
C  4.615918 -0.11781 -0.323923
C  6.012126 0.368873 0.064045
H  -0.73029 1.745733 1.401443
H  -0.213837 -1.527774 -1.422919
H  1.72391 1.985712 1.558902
H  2.253619 -1.273337 -1.265536
H  -2.443835 -1.641443 -1.615115
H  -5.035419 -1.436902 -1.326132
H  3.838875 1.31696 0.935477
H  -6.141316 1.234114 1.255213
H  -6.791695 0.058543 0.141342
H  6.543591 0.693494 -0.847279
H  6.580324 -0.476889 0.48829
H  6.015215 1.199532 0.791658
