program: Gaussian 09
title: 000153137
version: EM64L-G09RevD.01
frameworkgroup: C1[X(C17H15ClO7)]
method: RPBEPBE
basis: SDD
operation: Freq
keyword: #p
keyword: freq=noraman
keyword: PBEPBE/SDD
title: #p freq=noraman PBEPBE/SDD
converged: YES YES NO NO
title: Mulliken charges:
elementType: Cl O O O O O O O C C C C C C C C C C C C C C C C C H H H H H H H H H H H H H H H
charge: -0.067320 -0.342673 -0.240395 -0.397760 -0.446056 -0.418903 -0.420686 -0.189247 -0.557722 -0.479935 0.556513 0.239382 -0.001171 0.207541 0.252037 -0.514132 -0.449769 0.430421 -0.534559 -0.617896 0.403407 -0.219650 -0.326488 -0.336533 0.161988 0.231634 0.233844 0.266916 0.263122 0.262814 0.242573 0.276023 0.255004 0.251129 0.385243 0.373992 0.257685 0.257430 0.358779 0.393419
chargesum: 0.00000
title: Mulliken charges with hydrogens summed into heavy atoms:
elementType: Cl O O O O O O O C C C C C C C C C C C C C C C C C
charge: -0.067320 -0.342673 -0.240395 -0.012517 -0.072064 -0.060124 -0.027267 -0.189247 -0.092244 0.050103 0.556513 0.239382 -0.001171 0.207541 0.252037 -0.251318 -0.207196 0.430421 -0.258536 -0.362892 0.403407 0.031478 -0.326488 0.178583 0.161988
polarizability: 3.51974961e+02 -1.83233620e+01 2.05358540e+02 -6.09158753e+00 -6.21872068e-01 1.44547626e+02
1716.lowfreq: -0.6863 -0.0006 0.0012 0.0015 3.2140 4.7541 14.3552 17.8395 23.6998
frequency: 14.2323 17.2626 23.6597 25.0623 30.2156 49.3723 65.4176 102.5217 113.4145 126.7478 132.7655 135.1975 187.0321 208.8686 211.2105 225.1912 233.9641 246.0753 280.8564 289.8089 295.1669 315.7394 360.0847 380.1485 404.9230 413.2532 429.2301 446.7332 454.4491 465.2885 479.4557 508.2899 521.3819 546.3113 548.6675 552.4262 567.2981 599.2993 601.9268 622.0611 626.0875 633.8057 635.0247 663.7001 703.6861 720.1838 727.8928 785.4460 791.2161 807.1417 818.8745 844.3486 880.2889 884.8097 936.7755 941.9725 951.8942 972.1892 999.6617 1003.2523 1013.2686 1023.5629 1028.9867 1033.7410 1057.5820 1070.7547 1133.1424 1148.5361 1156.2223 1163.0384 1178.9841 1193.5247 1203.1800 1225.7294 1230.2580 1248.4172 1257.6859 1265.1650 1279.6516 1294.6442 1314.7119 1351.5831 1377.6121 1388.3511 1388.8078 1398.6802 1417.5505 1426.4292 1441.3367 1450.2518 1469.5745 1473.3170 1496.0465 1562.2307 1585.4706 1589.8820 1611.4845 1644.9727 1705.0412 2506.9724 2976.6017 2997.3391 3016.5007 3035.7955 3038.0332 3076.5566 3139.3182 3151.5760 3152.5510 3169.8821 3189.1338 3500.4495 3529.1236 3568.9639
redmass: 7.1531 6.1917 10.3742 9.7806 7.3011 6.4064 8.3265 8.0432 4.8662 3.0853 2.7394 8.2452 5.9767 8.5600 7.4744 6.9090 4.4487 5.9733 3.6055 6.3871 4.7108 6.9599 7.1299 5.3341 6.6301 1.1513 5.8282 1.7851 1.9254 3.4307 4.2771 1.7349 7.6128 5.8964 6.1312 2.9674 7.0327 3.5383 5.1402 4.9631 1.5303 3.1342 5.0243 8.0802 3.2768 6.4408 2.3485 1.7239 2.0297 1.6207 1.9137 2.0997 4.0298 1.6033 1.8876 1.8503 7.0870 5.4230 2.7552 1.8984 3.6171 3.4318 1.0669 3.8211 3.0474 3.1017 1.4137 1.2037 1.4702 2.4124 1.4932 1.4941 1.0766 1.4722 1.8235 2.1855 1.6530 1.2066 2.5932 1.5162 2.2086 2.6244 2.1850 3.8642 2.7786 2.4527 2.8178 1.8409 3.4952 1.1107 1.6386 1.5409 3.3998 3.1151 4.3023 7.2683 6.7559 4.3037 9.3905 1.0762 1.0558 1.0624 1.0604 1.1042 1.0966 1.1024 1.0892 1.0919 1.0925 1.0961 1.0919 1.0648 1.0644 1.0658
irintensity: 0.0368 0.2090 0.0961 0.4821 1.9886 0.0097 2.1603 1.1807 0.6422 8.1722 0.5467 2.1934 0.2038 0.2125 0.1201 2.2551 0.0858 5.4668 0.4867 3.0586 16.0541 0.9884 1.7336 10.5051 8.7656 105.1479 15.8421 85.3205 85.6320 8.3727 40.1918 40.8269 10.4037 6.7483 39.0589 3.1531 2.1735 6.4779 6.1498 2.2674 120.4997 13.5772 6.4670 37.7730 7.1775 24.2470 20.9217 0.8359 11.6420 9.6828 21.6997 75.3355 0.0585 18.4314 15.9307 15.1255 59.7076 100.6597 41.6219 0.1053 17.1847 141.3050 125.7520 326.2589 84.1040 1.0348 1.4450 2.0791 90.1208 288.1792 82.5624 81.8563 0.7368 125.2965 104.4776 65.1562 44.7269 0.8322 47.3001 73.5580 112.4612 41.2734 159.0217 7.1115 33.2093 4.9789 82.0542 73.1565 20.8483 61.6506 80.9987 36.9189 90.8410 68.0316 268.5433 33.1564 36.9613 827.2885 197.8156 541.3526 41.9034 17.3758 13.2130 11.0952 0.3877 14.4712 7.3894 3.4856 1.4482 3.7010 4.0291 62.0679 43.2998 49.5538
temp: 298.150 k
press: 1.00000 atm
elementType: 17 8 8 8 8 8 8 8 6 6 6 6 6 6 6 6 6 6 6 6 6 6 6 6 6 1 1 1 1 1 1 1 1 1 1 1 1 1 1 1
symmnumber: 1
zpe: 759075.2 jmol-1
zpe.correction: 0.289116 hartree
zpe.thermalcorrener: 0.312806 hartree
zpe.thermalcorrenthalpy: 0.313750 hartree
zpe.thermalcorrgfe: 0.231438 hartree
zpe.sumelectzpe: -1641.625458 hartree
zpe.sumelectthermal: -1641.601768 hartree
zpe.sumelectthermalent: -1641.600824 hartree
zpe.sumelectthermalfe: -1641.683137 hartree
dipole: -2.8453 -2.0996 -1.1715
dipole: 3.7251
quadrupole: -127.5815 -163.7651 -149.4874
quadrupole: -5.0196 -5.4711 -2.2999
quadrupole: 19.3632 -16.8205 -2.5427 -5.0196 -5.4711 -2.2999
hfenergy: -1641.9145741 hartree
pointgroup: C01 [X(C17H15Cl1O7)]
dipole: 1.1275279 -0.7994977 -0.4871895 debye
polarizability: 350.4366267|6.8545588|154.6443312|23.2369714|23.1744499|196.8001695 unknown
InChI: InChI=1S/C17H15ClO7/c18-11-3-1-9(5-13(11)20)2-4-12(19)17-14(21)6-10(7-15(17)22)25-8-16(23)24/h1,3,5-7,20-23H,2,4,8H2
charge 0 multiplicity 1
40 atoms
Cl -7.958267 -0.892757 -1.822642
O  -0.38018 1.205951 2.345584
O  4.927523 -0.741352 -0.717159
O  2.06468 1.338276 2.608782
O  0.17326 -1.013507 -1.228014
O  -6.147281 1.547317 -2.285837
O  8.47982 -0.377454 -0.086485
O  7.36107 -1.44759 -1.831416
C  -2.856272 0.645859 1.303906
C  -1.601057 0.136862 0.55363
C  -4.129103 0.268551 0.561292
C  -0.30157 0.526668 1.2376
C  1.024621 0.181077 0.711653
C  2.196606 0.623652 1.451248
C  1.278568 -0.566293 -0.49015
C  -4.587912 1.066355 -0.512971
C  -4.857037 -0.900521 0.908641
C  3.687309 -0.395241 -0.174611
C  3.511938 0.339192 1.011937
C  2.57695 -0.853094 -0.931003
C  -5.747682 0.715869 -1.239297
C  -6.020065 -1.267621 0.19477
C  -6.448401 -0.458059 -0.868404
C  6.116904 -0.30618 0.000523
C  7.331425 -0.7953 -0.776112
H  -2.862629 0.226529 2.325484
H  -2.782335 1.741798 1.421972
H  -1.586134 0.513381 -0.487089
H  -1.63139 -0.963415 0.436615
H  -4.062062 1.981624 -0.805089
H  -4.520638 -1.524054 1.744175
H  4.337491 0.70821 1.623428
H  2.766631 -1.422692 -1.846796
H  -6.58556 -2.164723 0.463129
H  1.027507 1.44894 2.770892
H  0.470185 -1.509781 -2.031699
H  6.161895 0.798212 0.079904
H  6.150551 -0.728106 1.024619
H  -6.977525 1.193384 -2.70317
H  9.29327 -0.682665 -0.57154
