program: Gaussian 09
title: 000153118
version: EM64L-G09RevD.01
frameworkgroup: C1[X(C3H9N2O)]
method: RPBEPBE
basis: SDD
operation: Freq
keyword: #p
keyword: freq=noraman
keyword: PBEPBE/SDD
title: #p freq=noraman PBEPBE/SDD
converged: YES YES NO NO
title: Mulliken charges:
elementType: O N N C C C H H H H H H H H H
charge: -0.165395 0.032253 -0.373624 -0.425293 -0.312062 -0.598781 0.296096 0.300652 0.257518 0.288233 0.438510 0.426277 0.271723 0.273334 0.290558
chargesum: 1.00000
title: Mulliken charges with hydrogens summed into heavy atoms:
elementType: O N N C C C
charge: -0.165395 0.032253 0.491164 0.171455 0.233689 0.236834
polarizability: 5.78439342e+01 1.42048342e-01 4.94023680e+01 2.35989011e+00 3.93750251e-02 4.12187392e+01
1716.lowfreq: -30.8279 -16.8941 0.0010 0.0010 0.0011 9.0234 136.8973 153.6514 182.0192
frequency: 136.8205 153.6261 181.9112 337.2594 392.4171 459.7089 623.4677 638.8108 776.3473 853.6891 885.4963 897.5207 938.5028 987.3398 1064.7203 1082.7411 1112.2264 1133.0555 1156.9644 1197.6768 1262.1157 1296.8623 1311.0783 1360.7694 1441.2850 1464.2336 1464.8081 1476.6638 1481.9790 1637.3217 2994.4221 3026.4126 3048.0660 3104.3520 3107.3405 3140.7910 3149.6569 3350.7428 3461.8409
redmass: 3.2035 1.1117 2.2944 3.9211 2.1676 2.6074 3.0186 5.2164 2.8736 3.2325 1.8287 2.3400 1.9179 2.3031 2.2285 1.4174 1.3624 1.2601 1.2491 1.1410 1.9602 1.1987 1.2409 1.7597 1.1584 1.0582 1.0680 1.0504 1.0812 1.0948 1.0384 1.0559 1.0660 1.1007 1.1097 1.1021 1.1050 1.0479 1.1057
irintensity: 16.7479 1.7539 2.7619 106.6332 3.4971 13.0699 37.4725 9.8611 4.4737 2.9747 9.6386 0.6415 2.9698 14.1849 29.9678 3.8947 3.4550 1.9108 10.4996 31.1096 11.2547 1.5942 16.8598 0.2224 15.2429 38.6761 7.0466 33.1692 8.5581 77.4360 5.4089 9.9373 2.2374 1.3224 10.1281 1.0146 0.6039 80.6771 94.9271
temp: 298.150 k
press: 1.00000 atm
elementType: 8 7 7 6 6 6 1 1 1 1 1 1 1 1 1
symmnumber: 1
zpe: 344470.9 jmol-1
zpe.correction: 0.131202 hartree
zpe.thermalcorrener: 0.137723 hartree
zpe.thermalcorrenthalpy: 0.138667 hartree
zpe.thermalcorrgfe: 0.101296 hartree
zpe.sumelectzpe: -303.585021 hartree
zpe.sumelectthermal: -303.578500 hartree
zpe.sumelectthermalent: -303.577556 hartree
zpe.sumelectthermalfe: -303.614926 hartree
dipole: 1.9211 0.4273 1.2413
dipole: 2.3268
quadrupole: -28.7899 -23.5724 -31.4994
quadrupole: 4.0849 -4.1762 2.8858
quadrupole: -0.8360 4.3815 -3.5455 4.0849 -4.1762 2.8858
hfenergy: -303.7162227 hartree
pointgroup: C01 [X(C3H9N2O1)]
dipole: 0.8003953 -0.113485 -0.4295787 debye
dipolederiv: -0.5065735 -0.3168021 -0.0508487 0.1217157 -0.2116482 -0.1002354 0.2173033 0.1483945 -0.2961353 -0.6122437 -0.0143561 0.1473146 -0.2339408 -0.0948073 0.1153742 0.2849359 0.0894931 -0.3307375 0.6388721 0.350242 -0.205665 0.3442899 -0.0934941 -0.0916794 -0.362596 -0.1399302 0.085998 0.2542564 -0.0471701 -0.001572 -0.0477558 0.2192925 -0.0805908 -0.1023245 -0.1188493 0.1952695 0.0634119 0.0083853 0.0826984 -0.2986738 0.149005 0.1943271 -0.004742 0.1246218 0.3017288 0.3253465 -0.0004244 0.0687958 -0.0031254 0.0091168 0.0074427 0.0424856 -0.0185816 0.2680181 0.0388188 0.0147896 -0.0253804 0.0133424 0.1083102 -0.0326649 -0.0214219 0.0165826 -0.0362686 0.0951289 -0.0646085 -0.0272841 -0.0319839 0.0787925 -0.0214033 -0.0272162 -0.0477787 0.1183183 0.0819013 -0.0099874 -0.0618524 0.0325745 0.0140039 -0.0291663 -0.0130928 -0.0503747 -0.0784527 0.0864907 0.0586195 -0.0418514 0.0652454 0.083919 -0.0185516 -0.0420375 -0.0280966 0.0859648 0.1247546 0.001794 0.0423119 0.0074208 0.2450938 0.0357012 0.0320036 0.0645253 0.2761402 0.2267267 0.0122215 -0.0035401 -0.0230398 0.3285715 0.0099614 0.0232617 -0.0298239 0.2425 0.0828297 0.0493194 -0.0133021 0.1003125 0.0113874 -0.0161108 -0.0014767 -0.0560446 0.079268 -0.0257292 -0.0185282 0.1020673 0.0090441 0.1222154 0.0129583 -0.0204099 -0.0009613 -0.0209625 0.1260088 -0.0234947 -0.0118917 -0.0554258 0.0302416 0.0146374 -0.0046726 0.0468237 0.1093509 unknown
polarizability: 58.1468511|-0.1016396|49.2301947|-0.6604453|1.2033257|41.0879956 unknown
InChI: InChI=1S/C3H9N2O/c1-5-2-3-6-4-5/h2-4H2,1H3
charge 1 multiplicity 1
15 atoms
O  -1.278056 -0.841148 0.213461
N  0.97054 0.039384 -0.390946
N  0.202392 -1.107499 -0.571128
C  -0.024566 1.148144 -0.468628
C  -1.21244 0.618469 0.423368
C  1.890245 -0.001891 0.786769
H  -0.347832 1.283645 -1.514868
H  0.420577 2.083831 -0.103651
H  -1.040179 0.831483 1.492055
H  -2.167195 1.047061 0.075777
H  -0.145114 -1.234354 -1.53814
H  0.588411 -1.974579 -0.154622
H  2.596442 -0.839973 0.673453
H  1.348681 -0.082836 1.748217
H  2.474696 0.929463 0.771883
