program: Gaussian 09
title: 000153117
version: EM64L-G09RevD.01
frameworkgroup: C1[X(C8H7N5O3)]
method: RPBEPBE
basis: SDD
operation: Freq
keyword: #pfreq=noraman
keyword: PBEPBE/SDD
title: #p freq=noraman PBEPBE/SDD
converged: NO NO NO NO
title: Mulliken charges:
elementType: O O O N N N N N C C C C C C C C H H H H H H H
charge: -0.231080 -0.389781 -0.191656 -0.397319 -0.365311 -0.086454 -0.074277 -0.407727 0.079757 0.093584 0.260836 0.026488 -0.210200 -0.156702 0.146292 -0.129924 0.325396 0.345587 0.273504 0.284784 0.299627 0.168016 0.336561
chargesum: 0.00000
title: Mulliken charges with hydrogens summed into heavy atoms:
elementType: O O O N N N N N C C C C C C C C
charge: -0.231080 -0.053220 -0.191656 -0.071923 -0.019723 -0.086454 -0.074277 -0.122943 0.079757 0.093584 0.260836 0.026488 0.063304 0.142925 0.146292 0.038092
polarizability: 2.77534764e+02 4.15042994e+00 1.38236754e+02 1.32070818e-03 -2.18568606e-03 5.16040465e+01
1716.lowfreq: -232.2068 -0.0005 0.0003 0.0007 6.3342 6.4084 12.7256 41.2002 62.3055
frequency: -232.2027 41.1511 62.3013 66.7183 108.9379 142.8055 183.4760 197.0884 221.0741 221.6740 283.1847 310.4544 323.6270 355.9810 448.8479 454.7319 498.7083 523.3814 540.7562 579.9283 612.5447 620.0814 667.8353 674.7469 679.3682 700.0595 741.8493 767.3343 808.4516 812.1513 870.4243 884.1384 922.3477 952.4350 953.3148 1067.0997 1078.1859 1121.2694 1137.6691 1195.9891 1239.8407 1249.5647 1267.3362 1326.4576 1334.1378 1370.8557 1382.7461 1397.9049 1415.8901 1495.2134 1518.1794 1534.2327 1597.3868 1616.0584 1622.0668 1667.2980 2879.7434 3174.8757 3252.3235 3535.7995 3540.9573 3571.2086 3583.5838
redmass: 1.0496 8.2016 6.2879 8.1828 5.6139 6.1540 5.2511 7.3254 7.1151 7.7299 7.2845 9.1278 3.2052 1.9140 2.0710 6.4460 9.9474 7.2890 2.0689 1.6953 4.0758 9.0378 5.7110 6.4960 9.1623 1.2517 5.2971 7.6599 6.9929 1.5038 5.1225 1.2477 8.0174 1.6811 6.9969 1.8692 1.7107 5.1981 2.6553 2.5471 2.2816 2.9166 1.3915 4.0055 3.3058 2.2560 2.9339 1.4138 2.6020 2.9002 4.1809 3.3482 7.3517 7.2648 10.2253 5.5452 1.0850 1.0908 1.0995 1.0780 1.0770 1.0669 1.0826
irintensity: 69.4866 0.0658 4.4486 3.2739 14.0739 0.0354 0.0281 7.5233 12.9833 5.5042 12.9750 9.6632 6.4098 48.5781 6.2097 8.2694 1.4165 1.2715 51.1815 185.5350 12.5601 14.3526 8.7557 28.1173 19.7061 127.9734 36.8335 1.4036 10.4076 18.6406 43.9666 29.7499 14.9075 14.3015 74.5884 217.0074 114.8655 52.6223 56.8030 13.0876 446.7065 20.8496 155.7068 106.0573 61.9367 17.8860 57.2580 12.0144 47.8017 698.8752 60.1770 339.8075 599.6935 122.9246 363.4980 170.3668 66.4583 28.6829 1.8255 18.5963 50.7439 20.0094 101.6318
temp: 298.150 k
press: 1.00000 atm
elementType: 8 8 8 7 7 7 7 7 6 6 6 6 6 6 6 6 1 1 1 1 1 1 1
symmnumber: 1
zpe: 415138.8 jmol-1
zpe.correction: 0.158118 hartree
zpe.thermalcorrener: 0.171526 hartree
zpe.thermalcorrenthalpy: 0.172471 hartree
zpe.thermalcorrgfe: 0.116996 hartree
zpe.sumelectzpe: -807.315809 hartree
zpe.sumelectthermal: -807.302400 hartree
zpe.sumelectthermalent: -807.301456 hartree
zpe.sumelectthermalfe: -807.356931 hartree
dipole: -7.5449 -5.6495 -0.0004
dipole: 9.4256
quadrupole: -114.6792 -95.1171 -93.4938
quadrupole: -7.3817 -0.0063 -0.0007
quadrupole: -13.5825 5.9796 7.6029 -7.3817 -0.0063 -0.0007
hfenergy: -807.4739269 hartree
pointgroup: C01 [X(C8H7N5O3)]
dipole: -2.9720759 -2.2177636 -0.0004912 debye
dipolederiv: -0.6477711 0.1839485 0.0000446 0.3107637 -1.2566664 -0.0000941 0.0001362 -0.0002818 -0.3721816 -0.2927569 0.2551475 -0.0000601 0.906037 -0.9295388 -0.0002041 0.000121 -0.0001656 -0.4003889 -1.5793858 -0.1633272 0.0001541 -0.051825 -0.3788766 -0.0000614 -0.0009077 -0.0001322 -0.3281992 -1.3026965 0.0625281 0.0000984 -0.4819472 -0.6276798 -0.0000963 -0.0000504 -0.0002105 -0.2508253 -0.432249 0.1538277 0.0000293 0.1461274 -0.4531789 -0.0000532 0.0000323 -0.0000447 -0.1999177 -0.6003037 0.1617013 0.0000514 -0.0265287 -0.3559973 -0.0000058 0.0000427 -0.0000425 -0.2549706 -1.3855342 0.5009183 0.0001811 1.1610065 -1.0401602 -0.0001646 0.0003256 -0.0001683 -0.2930607 -2.500074 0.0701767 0.0000416 -0.1960719 -0.3323283 0.000041 0.0000753 0.0000614 -0.3425954 -0.0902489 -0.439783 -0.0000569 -0.3622982 -0.5701011 -0.0000545 -0.0000077 -0.0000107 0.0026936 0.9446433 -0.1921613 -0.0001355 0.0171096 0.3311907 0.0000474 -0.0000841 0.000099 0.0587312 2.7329903 -0.1125692 -0.000137 -0.8745546 1.2446092 0.0001672 -0.0004075 0.0001791 0.2367972 1.7189884 -0.2723873 -0.0001708 -0.4560337 1.7637638 0.0002154 -0.0002839 0.0003417 0.2486644 0.0238807 -0.1982283 -0.0000594 -0.1430108 0.5349965 0.0000861 0.0000001 0.0001134 -0.0634193 1.2929624 0.4005996 0.0000529 0.9082514 -0.0862951 -0.000027 0.0003485 -0.0000062 -0.0944627 -0.8153295 -0.5384006 -0.0000902 -1.4334765 0.7421246 0.0001024 -0.0004735 0.0001425 0.027053 2.0604995 0.190468 -0.0001392 0.7923537 0.6513153 0.0003825 0.0010479 0.0005669 0.1053478 0.1552863 0.0004337 0.0000131 0.0811593 0.2041174 -0.0000049 0.0000407 0.0000484 0.351745 0.2943198 -0.0615583 0.0000057 -0.0425408 0.2186048 -0.0000155 0.0000055 -0.0000134 0.3586917 0.0191647 0.0070654 0.0000271 0.0029533 0.1158527 -0.0000093 0.0000124 -0.000016 0.1951439 0.0879632 0.0095554 0.00001 -0.0173016 0.0793032 -0.0000555 0.0000463 -0.0000666 0.3269343 0.2083172 0.0104219 -0.000003 -0.0655469 0.0723078 -0.0000324 0.0000022 -0.000027 0.1930253 0.0113891 0.1680797 0.0000854 0.0356781 -0.1655528 -0.0001711 -0.0001026 -0.0004069 0.111818 0.0959446 -0.1964566 0.0000576 -0.210304 0.2381895 0.0000079 0.0000808 0.00004 0.3833761 unknown
polarizability: 277.5481673|3.9190249|138.2233473|-0.0057063|0.0147646|51.6040491 unknown
InChI: InChI=1S/C8H7N5O3/c14-2-4(15)1-9-8-12-6-5(7(16)13-8)10-3-11-6/h1-3,9-10,12,15H
charge 0 multiplicity 1
23 atoms
O  -1.858525 2.747856 0.000655
O  4.241676 -1.55033 -0.000538
O  5.919262 0.693442 0.000778
N  -1.050173 -1.344422 -0.000205
N  -4.051255 0.528406 0.000445
N  -3.521185 -1.688021 0.000093
N  -0.302898 0.959886 0.000091
N  1.259482 -0.806021 -0.000291
C  -2.654814 0.465865 0.000249
C  -2.372945 -0.909406 0.000021
C  -0.066931 -0.342516 -0.000138
C  -1.624658 1.504488 0.000229
C  -4.527936 -0.774926 0.000379
C  2.34586 0.074607 -0.000158
C  3.680766 -0.261115 -0.000294
C  4.668962 0.836618 -0.000198
H  -0.848141 -2.346383 -0.000196
H  -4.591791 1.394016 0.00061
H  -5.585868 -1.023656 0.000498
H  1.413065 -1.815898 -0.00058
H  2.045456 1.125473 0.000056
H  4.19178 1.849217 0.001006
H  3.566414 -2.273281 -0.00041
