program: Gaussian 09
title: 000153108
version: EM64L-G09RevD.01
frameworkgroup: C1[X(C20H20N2O2)]
method: RPBEPBE
basis: SDD
operation: Freq
keyword: #p
keyword: freq=noraman
keyword: PBEPBE/SDD
title: #p freq=noraman PBEPBE/SDD
converged: YES YES NO NO
title: Mulliken charges:
elementType: O O N N C C C C C C C C C C C C C C C C C C C C H H H H H H H H H H H H H H H H H H H H
charge: -0.278862 -0.244137 -0.411021 -0.098953 -0.419409 0.245735 0.279900 0.142880 0.068587 0.178017 0.248655 0.177769 -0.857601 -0.460580 -0.837371 -0.409435 -0.351188 -0.367164 0.315730 -0.251633 -0.393458 -0.614634 0.249089 -0.753455 0.234598 0.281448 0.226719 0.214516 0.238992 0.310671 0.258319 0.236772 0.217893 0.246847 0.217222 0.230553 0.232532 0.249661 0.239437 0.234894 0.230887 0.248726 0.242814 0.249041
chargesum: 0.00000
title: Mulliken charges with hydrogens summed into heavy atoms:
elementType: O O N N C C C C C C C C C C C C C C C C C C C C
charge: -0.278862 -0.244137 -0.129573 -0.098953 -0.184811 0.245735 0.279900 0.142880 0.068587 0.178017 0.248655 0.177769 -0.177373 -0.149909 -0.124386 -0.162589 -0.133966 -0.136611 0.315730 -0.019102 -0.143797 0.090584 0.249089 -0.012875
polarizability: 4.46842492e+02 -4.52131779e+01 2.99724399e+02 -2.48976169e+00 -1.57670840e+00 1.18680426e+02
1716.lowfreq: -0.0008 -0.0005 0.0004 2.2491 4.1401 6.3879 25.2372 35.9159 46.1122
frequency: 25.1719 35.9109 46.1118 57.6358 68.8817 70.7146 81.3571 88.8332 108.4419 134.1923 138.7284 154.0897 158.9285 196.6406 205.5769 236.6423 244.9974 299.5312 304.2257 321.1585 328.6275 345.6710 363.8207 369.8600 399.0733 432.0450 442.7865 445.4943 457.6618 463.6643 502.6894 508.5791 551.0804 560.3392 573.4430 602.0188 610.2296 625.5058 651.0945 671.3986 703.8546 720.4174 738.2075 745.9569 766.2017 779.4762 792.7220 805.5095 836.5443 863.6478 889.1996 897.5132 911.2357 913.1641 929.1822 951.8724 995.5982 1007.7916 1018.1525 1026.4475 1032.7452 1036.7471 1042.9341 1059.3893 1068.9380 1109.0630 1111.7560 1118.3392 1138.6380 1163.5569 1184.2090 1194.0078 1206.2284 1219.1852 1225.2977 1261.1012 1284.7005 1291.1278 1311.3288 1335.3112 1358.7873 1378.5130 1381.8076 1389.2270 1395.3456 1401.2601 1416.7305 1426.4414 1444.4729 1449.2173 1452.9587 1454.9847 1465.3951 1468.7060 1471.6152 1472.5695 1479.1834 1488.7673 1496.2056 1567.1586 1584.9510 1594.8812 1615.2750 1634.5700 1640.1421 1670.4727 2767.9720 2932.6174 2962.3466 2975.6089 3002.6554 3006.2190 3055.6326 3056.8778 3088.0301 3088.6333 3094.7489 3098.8661 3139.7316 3141.7364 3156.2837 3168.4164 3172.0666 3182.7548 3230.1057 3567.4188
redmass: 5.7609 3.5644 3.8691 1.3403 3.4754 1.1270 2.4367 2.5418 2.0335 1.5533 1.5562 2.7969 3.3497 4.4885 4.5279 4.2895 3.1450 4.0773 3.8101 3.1689 4.4994 4.6907 3.1519 5.1462 3.5546 3.5621 1.3843 3.3192 3.8647 4.5234 3.7248 4.6561 3.2472 4.7200 4.0766 4.4779 4.0113 4.6230 4.8972 6.5186 3.0012 5.4110 3.9422 4.1253 2.3567 3.2752 4.9127 1.5651 1.4526 5.0266 3.1211 4.5798 1.3937 1.2901 1.3480 3.1113 2.0977 2.3682 1.8354 1.5380 1.5412 1.6214 2.3492 3.3533 1.9155 1.7369 1.3256 2.0262 2.0973 1.9233 2.2574 2.5252 2.6117 2.2161 1.5942 1.5755 2.0116 1.9324 2.0945 2.6004 3.2543 2.2598 1.2417 1.4948 1.5484 1.6375 2.0874 2.7037 1.9185 2.0543 1.0810 1.0471 1.0514 2.3735 1.2136 1.0634 1.0963 1.0996 1.0934 6.2793 7.0087 6.4702 6.7884 8.2308 8.9689 6.7372 1.0782 1.0454 1.0413 1.0401 1.0910 1.0367 1.0950 1.0928 1.0971 1.0930 1.0974 1.1013 1.0887 1.1010 1.0858 1.0958 1.0912 1.0983 1.0920 1.0782
irintensity: 1.0292 3.5283 1.0738 0.5387 1.8027 0.5154 1.2879 0.5969 0.7201 1.2009 5.2566 0.5944 3.0367 0.7602 0.8872 3.2666 1.9275 0.7147 3.2863 1.3266 10.5575 2.6540 1.7995 3.6713 18.5622 2.0906 122.0400 20.4256 11.9726 11.8296 1.8919 4.7684 4.4394 20.6553 5.2998 13.4604 5.7466 2.4406 9.1555 0.2470 8.7369 8.0485 3.9503 12.7352 17.6077 38.7323 3.2509 51.9248 22.8907 3.1109 6.0214 20.4461 24.9954 0.3277 0.5435 8.1647 82.0435 49.0298 18.8830 0.5170 4.5568 9.2692 12.2121 25.4749 37.0327 0.7606 40.8987 26.2423 97.6775 9.1938 393.4947 206.8293 82.4036 37.0499 45.4221 4.6800 73.6230 2.5526 16.5169 34.7775 52.9872 171.1883 35.8571 9.0323 30.3593 3.3388 15.6646 10.6747 8.1456 36.0660 29.5100 17.5352 10.5913 102.6991 41.0466 17.2848 13.4540 62.4446 37.0136 76.0146 12.9630 10.6938 30.1861 9.2759 159.5965 86.6416 94.8706 90.5137 179.4062 26.3318 26.5231 5.4735 12.6989 32.2477 16.0431 30.2318 8.8073 12.3178 15.0618 9.4300 2.0754 10.3215 14.8359 22.7564 4.2415 23.9074
temp: 298.150 k
press: 1.00000 atm
elementType: 8 8 7 7 6 6 6 6 6 6 6 6 6 6 6 6 6 6 6 6 6 6 6 6 1 1 1 1 1 1 1 1 1 1 1 1 1 1 1 1 1 1 1 1
symmnumber: 1
zpe: 921474.5 jmol-1
zpe.correction: 0.350971 hartree
zpe.thermalcorrener: 0.373645 hartree
zpe.thermalcorrenthalpy: 0.374589 hartree
zpe.thermalcorrgfe: 0.298106 hartree
zpe.sumelectzpe: -1032.355674 hartree
zpe.sumelectthermal: -1032.333000 hartree
zpe.sumelectthermalent: -1032.332056 hartree
zpe.sumelectthermalfe: -1032.408540 hartree
dipole: 3.2361 -0.2005 0.3150
dipole: 3.2576
quadrupole: -103.6338 -122.0766 -146.1691
quadrupole: -13.5929 0.4802 2.3056
quadrupole: 20.3260 1.8833 -22.2093 -13.5929 0.4802 2.3056
hfenergy: -1032.7066454 hartree
pointgroup: C01 [X(C20H20N2O2)]
dipole: 1.277484 -0.0303299 0.0984138 debye
polarizability: 449.7995892|-39.6409117|296.516967|-8.8459552|-1.9988729|118.930761 unknown
InChI: InChI=1S/C20H20N2O2/c1-11-17-10-22(4)8-7-15(17)12(2)20-19(11)16-9-14(24-13(3)23)5-6-18(16)21-20/h5-10,20-21H,1-4H3
charge 0 multiplicity 1
44 atoms
O  -4.842729 -0.544345 -0.014666
O  -4.006416 -2.730331 0.26538
N  -0.185814 2.600595 0.076618
N  4.694148 -1.681774 -0.08201
C  0.861596 1.667411 0.604184
C  0.233359 0.293203 0.344755
C  2.25662 1.822153 0.032721
C  -1.212967 0.515799 0.211477
C  1.003119 -0.841274 0.171411
C  3.033324 0.686211 -0.104712
C  2.461368 -0.680412 0.095826
C  -1.411923 1.930996 0.036932
C  2.7318 3.24306 -0.171928
C  -2.323962 -0.361102 0.205856
C  0.360066 -2.201338 -0.050592
C  3.312686 -1.777775 0.113337
C  4.460992 0.701478 -0.440433
C  -2.702854 2.467585 -0.170457
C  -3.609866 0.196253 0.004091
C  5.237376 -0.4310 -0.406296
C  -3.803488 1.584525 -0.186028
C  5.521494 -2.896569 -0.135475
C  -4.960635 -1.935761 0.106622
C  -6.424142 -2.315984 0.008275
H  0.908381 1.835862 1.715474
H  -0.133919 3.597189 0.287711
H  3.791347 3.308219 -0.467069
H  2.612342 3.846156 0.754805
H  2.139687 3.748616 -0.960961
H  -2.218839 -1.429236 0.382029
H  -0.520097 -2.109336 -0.711074
H  0.00713 -2.656704 0.895175
H  1.049074 -2.913661 -0.533172
H  2.942926 -2.790279 0.288679
H  4.953047 1.643392 -0.69404
H  -2.856088 3.5422 -0.31417
H  6.308815 -0.41634 -0.622734
H  -4.822029 1.956616 -0.332695
H  5.510238 -3.360545 -1.142051
H  5.153442 -3.635284 0.596765
H  6.564065 -2.649347 0.125963
H  -7.016815 -1.75955 0.754246
H  -6.533425 -3.397697 0.172183
H  -6.817634 -2.051176 -0.988953
