program: Gaussian 09
title: 000153106
version: EM64L-G09RevD.01
frameworkgroup: C1[X(C13H7N3O)]
method: RPBEPBE
basis: SDD
operation: Freq
keyword: #p
keyword: freq=noraman
keyword: PBEPBE/SDD
title: #p freq=noraman PBEPBE/SDD
converged: NO NO NO NO
title: Mulliken charges:
elementType: O N N N C C C C C C C C C C C C C H H H H H H H
charge: -0.211975 0.054902 0.080577 -0.414725 -0.253719 0.527568 0.509959 -0.356990 -0.247400 0.536586 -0.451927 -0.457221 -0.412488 -0.420674 -0.209317 -0.206364 0.058442 0.287716 0.274666 0.245389 0.245068 0.233915 0.230710 0.357301
chargesum: 0.00000
title: Mulliken charges with hydrogens summed into heavy atoms:
elementType: O N N N C C C C C C C C C C C C C
charge: -0.211975 0.054902 0.080577 -0.057424 -0.253719 0.527568 0.509959 -0.356990 -0.247400 0.536586 -0.164211 -0.182555 -0.167099 -0.175606 0.024598 0.024347 0.058442
polarizability: 2.82725573e+02 -4.13524873e+00 1.93781240e+02 1.56330586e-02 -6.85019589e-03 6.05503359e+01
1716.lowfreq: -2.6920 -0.0006 -0.0004 0.0007 4.1109 9.7461 72.3937 105.6765 176.0868
frequency: 72.3871 105.6753 176.0868 179.9363 182.8228 254.9402 324.9752 343.0950 399.7597 415.6575 463.2863 465.5077 468.2828 493.3030 546.5431 573.4380 618.7371 620.2093 638.6364 641.8023 703.2348 715.2309 757.4223 766.8311 791.9165 797.7476 816.1764 836.5889 882.4809 933.7245 938.0056 949.6595 959.4251 992.3422 1000.9469 1014.0933 1031.9114 1045.7933 1086.1425 1143.2855 1163.1571 1183.5507 1199.3555 1237.3761 1269.4164 1303.3835 1359.0380 1394.6545 1406.6654 1426.1701 1458.6892 1465.8960 1490.2888 1521.7085 1578.4177 1609.2594 1614.7985 1632.2639 1642.4274 3130.8348 3131.7642 3149.7479 3151.5003 3166.4630 3169.1136 3537.1776
redmass: 9.0180 5.5975 4.1277 6.9590 6.9040 4.2790 6.9594 5.5637 9.4349 9.0966 5.4037 3.2050 5.2266 7.7066 7.3821 7.3531 3.3312 9.0186 3.5944 10.4831 2.6624 8.0118 1.7872 1.4284 5.2263 1.6076 7.9375 3.3604 3.6461 1.4857 7.0681 1.4789 7.0376 1.3831 1.3979 3.3017 5.1840 2.1672 3.3226 2.8538 2.0085 1.5717 1.3172 1.6914 4.1647 3.3165 2.3575 2.4104 1.9242 2.0218 6.8933 4.0227 3.6381 7.0491 11.7914 6.9010 7.8885 7.7670 7.0715 1.0877 1.0870 1.0929 1.0927 1.0980 1.0977 1.0794
irintensity: 1.4289 4.4307 3.0479 2.5869 0.3102 0.0065 1.4156 0.2748 3.8299 6.9139 3.0118 0.3253 0.0214 3.0195 6.3212 0.4366 4.5202 11.2565 2.5065 2.2507 3.1179 0.4028 105.9900 4.5670 0.4821 105.1760 8.2757 0.3221 38.4338 0.0010 18.5152 0.0839 55.6059 0.3723 2.6400 9.7749 30.2810 3.1123 39.0773 14.7272 19.9332 17.0392 15.2925 6.6780 3.5743 60.2327 15.3395 9.0229 0.8553 3.4544 47.3504 4.1328 15.7846 42.8633 329.5227 5.4168 91.3636 31.2748 374.0123 1.9612 1.0406 13.6670 18.0841 19.4089 12.3501 84.7678
temp: 298.150 k
press: 1.00000 atm
elementType: 8 7 7 7 6 6 6 6 6 6 6 6 6 6 6 6 6 1 1 1 1 1 1 1
symmnumber: 1
zpe: 451836.5 jmol-1
zpe.correction: 0.172095 hartree
zpe.thermalcorrener: 0.183308 hartree
zpe.thermalcorrenthalpy: 0.184253 hartree
zpe.thermalcorrgfe: 0.134818 hartree
zpe.sumelectzpe: -737.932517 hartree
zpe.sumelectthermal: -737.921304 hartree
zpe.sumelectthermalent: -737.920360 hartree
zpe.sumelectthermalfe: -737.969795 hartree
dipole: 6.3272 -2.1626 0.0004
dipole: 6.6866
quadrupole: -101.0719 -87.5269 -99.6284
quadrupole: 13.7028 0.0007 -0.0002
quadrupole: -4.9962 8.5488 -3.5527 13.7028 0.0007 -0.0002
hfenergy: -738.1046125 hartree
pointgroup: C01 [X(C13H7N3O1)]
dipole: -2.4910407 0.8457784 0.0001394 debye
dipolederiv: -1.6073734 0.3095522 0.0001198 0.3657406 -0.4856874 -0.0000446 -0.0000563 0.0000203 -0.376712 -1.4253794 0.1190527 0.0000471 -0.1350823 -0.2202955 0.0000106 0.0000817 0.0000062 -0.2476748 0.6807061 0.3421025 -0.0000741 -0.3822909 -0.1696329 0.0000254 0.000003 -0.0000288 -0.1330828 -0.9181756 -0.243823 0.0000528 0.9685305 -0.3327692 -0.0000429 0.000044 0.0000122 -0.2493994 -0.1977536 0.0414038 0.0000169 -0.2080445 -0.019221 0.0000097 -0.0000405 -0.0000298 -0.0669474 -0.6417546 -0.1037114 0.000044 -0.319097 -0.0685755 0.0000136 0.0000698 0.0000125 0.0092677 0.0852837 -0.0757367 -0.000012 0.1269426 -0.0386532 -0.0000164 0.0000003 0.0000121 0.0315762 1.3039556 -0.0190271 -0.000067 0.3538461 0.4408662 -0.000024 -0.000056 0.0000056 0.1207269 0.164953 -0.0358518 -0.0000051 -0.4176195 -0.3391141 0.0000357 -0.0000411 0.000005 0.0956165 -0.0756102 -0.065193 0.0000057 -0.0486096 -0.0326535 -0.000003 0.0000161 0.0000043 0.1042077 0.2371162 -0.1465783 -0.0000285 0.1383885 0.0290644 -0.0000051 -0.0000343 0.0000048 -0.124425 0.0513434 0.1917337 -0.0000008 0.0638768 0.0218726 0.0000114 0.0000036 -0.0000149 -0.1467293 0.1857233 0.0709228 -0.0000213 -0.1186297 0.1198746 0.0000223 -0.0000352 0.000007 -0.155099 0.0781851 -0.0595797 -0.0000208 0.1057139 0.0639078 0.0000084 -0.0000085 0.0000287 -0.1754011 -0.2382874 0.1974131 0.0000159 0.240089 0.0578386 -0.0000085 0.0000134 0.0000017 -0.1441962 -0.0106443 -0.2136633 -0.0000198 -0.2351722 -0.0216453 0.0000288 -0.0000287 0.000024 -0.1411304 2.1155004 -0.3372784 -0.0001259 -0.5949051 0.7840753 0.0000457 0.0000064 -0.0000079 0.3249513 0.0561529 0.0709014 0.0000092 0.0458894 0.0233355 -0.0000083 0.0000096 -0.0000084 0.1579335 0.0675177 -0.0677687 0.0000016 -0.0448831 -0.0207562 -0.0000097 0.0000013 -0.0000001 0.1604258 -0.0927159 -0.0550023 0.0000149 0.0009775 0.0784646 -0.0000043 0.0000205 0. 0.1535173 -0.0969651 0.0181148 0.0000186 -0.0403424 0.0805769 -0.0000026 0.000015 -0.000009 0.1582893 0.0464484 -0.069586 0.000004 -0.0908633 -0.0879991 -0.000005 0.0000076 -0.0000078 0.160592 0.0068299 0.0955142 0.0000171 0.1154316 -0.05608 -0.0000235 0.0000159 -0.0000224 0.1594775 0.2249436 0.0360885 0.0000078 0.1101132 0.1932065 -0.0000137 -0.0000078 -0.0000153 0.3242158 unknown
polarizability: 282.7419892|-3.9547327|193.7648245|-0.0156469|0.0068185|60.5503359 unknown
InChI: InChI=1S/C13H7N3O/c17-13-14-11-8-5-1-3-7-4-2-6-9(10(7)8)12(11)15-16-13/h1-6,16H
charge 0 multiplicity 1
24 atoms
O  4.648326 -0.752341 -0.000142
N  2.308992 -1.167077 -0.00012
N  2.014916 1.757319 -0.00005
N  3.221955 1.087615 -0.000138
C  -1.136251 -0.027137 0.00015
C  -0.220682 -1.13017 0.000039
C  -0.471135 1.243866 0.000198
C  1.132363 -0.544656 0.00004
C  0.963575 0.933165 0.000051
C  -2.549218 -0.179669 0.000252
C  -0.719539 -2.437069 0.000016
C  -1.242399 2.410413 0.000347
C  -3.038431 -1.530623 0.00021
C  -3.320644 1.033349 0.000392
C  -2.142438 -2.616227 0.0001
C  -2.673049 2.280568 0.000435
C  3.463713 -0.332546 -0.000227
H  -0.046119 -3.29969 -0.000048
H  -0.779311 3.402015 0.000373
H  -4.119035 -1.716989 0.000283
H  -4.415753 0.98488 0.000464
H  -2.543018 -3.635816 0.000087
H  -3.278955 3.193452 0.000539
H  4.047535 1.691968 -0.000149
