program: Gaussian 09
title: 000153090
version: EM64L-G09RevD.01
frameworkgroup: C1[X(C18H12O4S2)]
method: RPBEPBE
basis: SDD
operation: Freq
keyword: #p
keyword: freq=noraman
keyword: PBEPBE/SDD
title: #p freq=noraman PBEPBE/SDD
converged: YES YES NO NO
title: Mulliken charges:
elementType: S S O O O O C C C C C C C C C C C C C C C C C C H H H H H H H H H H H H
charge: 0.987155 -0.008438 -0.176327 -0.566487 -0.493348 -0.501668 0.054894 0.390750 0.302210 0.294345 0.302308 0.207474 -0.430509 0.409068 -0.448379 -0.452185 -0.338011 -0.379030 -0.426814 -0.397701 -0.084337 -0.265008 -0.261106 -0.923398 0.232892 0.239906 0.245059 0.332061 0.301742 0.251825 0.244947 0.291293 0.300597 0.276473 0.103550 0.384195
chargesum: 0.00000
title: Mulliken charges with hydrogens summed into heavy atoms:
elementType: S S O O O O C C C C C C C C C C C C C C C C C C
charge: 0.987155 0.095112 -0.176327 -0.182291 -0.493348 -0.501668 0.054894 0.390750 0.302210 0.294345 0.302308 0.207474 -0.430509 0.409068 -0.215487 -0.207126 -0.098105 -0.046969 -0.125072 -0.145876 -0.084337 -0.020060 0.030187 -0.346328
polarizability: 4.58946099e+02 -5.33675341e+00 2.73656064e+02 1.21879497e+00 1.01713680e+01 1.30876886e+02
1716.lowfreq: 0.0010 0.0017 0.0019 2.7571 7.0115 9.1203 24.5080 30.1754 48.0624
frequency: 24.4653 30.1738 48.0549 60.3556 69.4962 91.2718 117.1287 139.4780 163.0833 167.1210 176.3368 186.0258 204.3495 213.8646 219.8204 280.0753 288.2481 309.1636 319.9054 339.5714 363.5030 371.5599 386.5830 400.2010 425.2339 445.2681 459.7953 467.8009 477.3085 511.3611 528.7059 537.2858 574.2882 589.8624 614.0285 633.8408 644.8216 653.0855 671.2412 730.3967 743.0903 778.0538 786.5625 789.4474 816.8711 823.9243 838.8099 849.7307 862.4536 914.8709 925.2818 940.0518 958.9854 966.8662 971.0461 979.1096 987.3072 990.6596 1014.0386 1048.6411 1063.6379 1074.6971 1096.9700 1111.7247 1154.0115 1162.6525 1179.1159 1199.6304 1214.1505 1250.5338 1252.6541 1260.0497 1282.1940 1312.4439 1354.4665 1389.6093 1393.7621 1401.7860 1419.2968 1436.2525 1454.0915 1471.3188 1477.1379 1524.5960 1537.0476 1571.8829 1585.1114 1591.3624 1603.1619 1619.7162 2443.2765 3051.3047 3117.3534 3138.0757 3140.7879 3154.9524 3155.4665 3156.5477 3165.2821 3169.9331 3177.1120 3480.7344
redmass: 9.0610 8.8146 7.7175 9.2937 6.3725 7.5387 6.0659 5.2868 3.2970 3.3930 4.1748 1.4588 3.6742 2.2127 5.4661 4.1241 5.1535 5.0786 6.2508 4.4960 8.5737 7.1146 5.9850 6.3964 4.5723 6.6724 3.6944 5.3130 4.5382 4.6974 7.2404 6.1016 5.4463 6.9615 5.7349 7.6446 3.0460 6.7074 3.8335 3.2004 5.9367 1.5693 2.1347 3.5188 1.9073 7.7380 9.6647 1.4407 1.7779 3.8417 2.1470 2.9858 1.4461 6.6047 1.6070 2.5053 1.4261 2.0118 1.5433 1.1984 2.5265 2.1092 2.1608 2.8975 1.4568 1.4659 1.4518 1.4526 1.6235 1.3078 1.3160 2.0736 3.5994 1.9435 3.3971 3.9982 4.5460 6.4680 4.6430 3.9488 2.3792 1.2431 2.6175 5.2184 7.9562 7.8055 5.1405 6.9776 7.5995 7.5154 1.0383 1.0587 1.1066 1.0889 1.0864 1.0918 1.0917 1.0904 1.0946 1.0992 1.0946 1.0661
irintensity: 1.5926 0.7326 3.0165 0.9264 0.9140 0.3426 2.1076 2.0304 22.2704 9.6770 12.2201 22.0502 19.1298 15.7909 7.5500 36.0273 8.9466 24.6105 18.4709 11.7120 33.9021 13.6671 5.7571 8.4398 0.3800 56.6727 4.4796 1.8153 3.7424 2.8514 64.5324 57.0695 84.7254 10.6894 3.4024 8.0867 12.8838 6.9586 7.2435 5.5341 5.2800 2.5243 7.1392 2.3736 38.8287 28.3540 74.6200 68.8003 4.0863 3.8524 0.9176 9.2384 2.2237 60.6925 10.2980 46.2588 1.1096 7.7069 4.0842 64.0557 87.2053 18.0657 1.6257 5.0474 4.1853 0.6147 8.2809 0.2935 14.8817 12.6837 4.7701 0.3823 78.2846 73.9952 25.7990 7.7911 0.4902 28.3146 26.0403 3.7241 26.3093 25.9731 4.4660 19.6762 126.1547 95.6694 8.9884 83.7716 8.6884 16.4446 24.0503 21.0556 3.3368 13.4936 4.0044 4.6595 5.3333 7.2122 12.0076 19.1552 8.7116 49.2432
temp: 298.150 k
press: 1.00000 atm
elementType: 16 16 8 8 8 8 6 6 6 6 6 6 6 6 6 6 6 6 6 6 6 6 6 6 1 1 1 1 1 1 1 1 1 1 1 1
symmnumber: 1
zpe: 656246.5 jmol-1
zpe.correction: 0.249951 hartree
zpe.thermalcorrener: 0.271063 hartree
zpe.thermalcorrenthalpy: 0.272007 hartree
zpe.thermalcorrgfe: 0.198944 hartree
zpe.sumelectzpe: -1788.331890 hartree
zpe.sumelectthermal: -1788.310778 hartree
zpe.sumelectthermalent: -1788.309834 hartree
zpe.sumelectthermalfe: -1788.382897 hartree
dipole: 6.8671 -2.1979 -0.1469
dipole: 7.2118
quadrupole: -168.8329 -149.9946 -156.9879
quadrupole: 10.5254 -19.2407 4.9140
quadrupole: -10.2277 8.6105 1.6172 10.5254 -19.2407 4.9140
hfenergy: -1788.581841 hartree
pointgroup: C01 [X(C18H12O4S2)]
dipole: -2.6685613 0.9638118 0.0173518 debye
polarizability: 458.1279581|-12.1383777|274.7284892|-7.9827171|-6.0583768|130.6226014 unknown
InChI: InChI=1S/C18H12O4S2/c19-18-15-3-1-2-12-10(9-23)4-6-14(17(12)15)13-7-5-11(8-16(13)18)24(20,21)22/h1-8,20,23H,9H2
charge 0 multiplicity 1
36 atoms
S  5.218627 0.172677 0.037606
S  -6.079763 1.427726 1.407551
O  0.821252 -2.973798 0.096541
O  5.353555 0.110286 1.890234
O  5.661101 -1.264089 -0.557019
O  5.916398 1.533892 -0.492015
C  -1.740994 -0.294269 -0.132684
C  -0.89688 0.875887 -0.164841
C  0.572336 0.722437 -0.104917
C  -1.173998 -1.614276 -0.042984
C  -3.183226 -0.156048 -0.194054
C  1.148963 -0.586007 -0.021348
C  0.300214 -1.81353 0.01625
C  -3.774216 1.161745 -0.283114
C  -1.514128 2.138879 -0.255145
C  -2.923109 2.276169 -0.313123
C  1.454363 1.843405 -0.135978
C  2.554764 -0.761613 0.034301
C  -2.00344 -2.749654 -0.010185
C  -3.988846 -1.341045 -0.158465
C  3.358599 0.374245 -0.000302
C  -3.412728 -2.613916 -0.067214
C  2.847503 1.684267 -0.080794
C  -5.267805 1.361676 -0.331453
H  -0.91207 3.051028 -0.285526
H  1.057656 2.859404 -0.200621
H  -3.358251 3.279558 -0.374836
H  2.95936 -1.777767 0.089098
H  -1.525878 -3.73226 0.058849
H  -5.079095 -1.254737 -0.208075
H  -4.0492 -3.503944 -0.042712
H  3.527022 2.541399 -0.113966
H  -5.520898 2.347182 -0.751234
H  -5.792783 0.5926 -0.917205
H  -5.617327 0.192449 1.833342
H  6.30682 -0.097457 2.116937
