program: Gaussian 09
title: 000153082
version: EM64L-G09RevD.01
frameworkgroup: C1[X(C17H10O7S2)]
method: RPBEPBE
basis: SDD
operation: Freq
keyword: #p
keyword: freq=noraman
keyword: PBEPBE/SDD
title: #p freq=noraman PBEPBE/SDD
converged: YES YES NO NO
title: Mulliken charges:
elementType: S S O O O O O O O C C C C C C C C C C C C C C C C C H H H H H H H H H H
charge: 0.973127 0.990869 -0.168064 -0.560140 -0.493312 -0.489581 -0.565792 -0.488019 -0.496573 0.078337 0.412151 0.297216 0.298823 0.604678 0.203378 -0.414633 -0.363378 -0.440613 -0.315780 -0.324537 -0.417876 -0.397842 -0.373468 -0.081065 -0.244777 -0.258124 0.247147 0.301567 0.240943 0.303383 0.288987 0.333733 0.251233 0.293779 0.387217 0.387006
chargesum: 0.00000
title: Mulliken charges with hydrogens summed into heavy atoms:
elementType: S S O O O O O O O C C C C C C C C C C C C C C C C C
charge: 0.973127 0.990869 -0.168064 -0.172923 -0.493312 -0.489581 -0.178786 -0.488019 -0.496573 0.078337 0.412151 0.297216 0.298823 0.604678 0.203378 -0.414633 -0.363378 -0.193466 -0.014213 -0.083594 -0.114493 -0.108855 -0.039735 -0.081065 0.006455 0.035655
polarizability: 4.63569323e+02 1.11666097e+00 2.85825103e+02 3.12381576e-02 2.05395438e+00 1.31067438e+02
1716.lowfreq: -3.0194 -1.4590 -0.0002 0.0017 0.0020 8.2385 23.1715 26.9483 41.8675
frequency: 23.1535 26.9288 41.8643 51.1226 70.2363 78.6409 118.1256 127.7361 140.5623 149.4324 165.7680 171.7478 181.4190 191.5574 205.7515 219.6186 230.2342 250.0200 274.5890 290.3342 306.6846 319.5096 328.1226 335.9970 367.2270 381.3179 386.1380 398.5702 423.9916 428.3515 456.3392 461.9686 471.0190 478.8016 530.5477 534.5805 552.1012 563.3573 577.3934 613.1997 631.6820 648.4930 653.0002 676.6912 731.9961 782.4247 786.7517 796.0163 822.6208 832.3037 837.7809 851.7344 868.9024 882.3367 929.9880 942.3680 959.2462 965.9091 970.0934 982.0011 989.6135 1003.5107 1019.1015 1031.1346 1046.1778 1047.4575 1062.1616 1079.2774 1102.3645 1135.5922 1181.5079 1188.7902 1201.5010 1221.4891 1253.6728 1284.1758 1310.3598 1346.2928 1384.4700 1390.4199 1401.0466 1416.0606 1429.5742 1452.0802 1472.3031 1512.7062 1539.7544 1574.1415 1579.9662 1587.9156 1604.1780 1622.1035 3151.4502 3154.6748 3156.4994 3159.3032 3164.2689 3174.8340 3178.9419 3183.4837 3478.1812 3480.5862
redmass: 9.2536 9.2368 8.5344 7.5742 6.2902 10.3446 5.8475 9.5747 6.5646 9.8986 3.9058 2.1715 2.2345 4.1234 3.5895 4.4279 6.9264 2.6703 6.0805 4.2723 7.9167 8.9916 7.8212 8.8855 8.9788 8.3496 5.1454 8.8703 4.8516 9.8309 3.9713 6.2847 3.7409 7.7136 8.0719 8.7520 8.5053 8.0880 6.1244 5.9571 5.0620 3.1599 6.6846 8.1809 3.2974 7.3636 5.4987 1.8646 2.4967 9.6755 11.7226 1.3849 1.8331 6.4085 6.9918 1.8320 2.4970 2.7445 15.1088 1.5225 1.3904 2.2366 1.7118 3.5332 1.2194 1.2405 2.6714 2.0499 2.9322 1.7197 1.6122 2.1209 1.4211 1.5126 1.5556 3.1060 2.0395 3.1783 3.4572 5.0766 6.6133 3.5576 5.6007 2.3505 2.7861 5.0205 8.2903 7.8238 7.4036 5.3950 7.5715 7.5760 1.0881 1.0927 1.0896 1.0895 1.0927 1.0968 1.0992 1.0924 1.0662 1.0662
irintensity: 1.0312 0.1807 1.7542 3.1425 0.5943 0.7897 1.4202 0.4561 3.1301 3.7640 14.5727 28.9562 27.9038 3.0410 35.4594 13.6305 22.7266 17.6724 20.8606 79.5312 19.1136 2.2595 23.8016 7.7187 26.8683 18.1669 14.6893 14.4592 1.9682 174.9267 4.6914 6.6192 4.3488 3.2727 81.7255 77.6409 73.0294 44.4079 87.3576 3.9571 3.9049 13.9811 8.1033 18.1664 2.1171 13.1478 1.7035 9.6426 25.0584 95.4457 78.3259 85.9188 2.4348 29.8812 6.8508 0.4267 52.3647 40.6453 79.1200 5.5747 0.3631 4.1115 5.1652 25.7535 43.1117 99.3366 69.5569 8.8493 4.4533 5.9221 2.9551 6.5121 5.4058 26.6476 32.4551 115.7303 25.7532 48.9106 2.9046 3.4275 23.7815 25.1114 7.6884 20.2597 4.7287 8.1129 146.7988 67.5516 8.4617 16.0895 9.1824 5.3219 3.4305 11.1761 2.3313 8.8296 4.4120 10.7442 5.7817 2.7781 56.9652 54.5936
temp: 298.150 k
press: 1.00000 atm
elementType: 16 16 8 8 8 8 8 8 8 6 6 6 6 6 6 6 6 6 6 6 6 6 6 6 6 6 1 1 1 1 1 1 1 1 1 1
symmnumber: 1
zpe: 611468.3 jmol-1
zpe.correction: 0.232896 hartree
zpe.thermalcorrener: 0.256370 hartree
zpe.thermalcorrenthalpy: 0.257314 hartree
zpe.thermalcorrgfe: 0.179145 hartree
zpe.sumelectzpe: -1974.364242 hartree
zpe.sumelectthermal: -1974.340768 hartree
zpe.sumelectthermalent: -1974.339824 hartree
zpe.sumelectthermalfe: -1974.417993 hartree
dipole: 2.8325 -1.1526 2.6966
dipole: 4.0771
quadrupole: -194.5526 -161.9280 -169.9923
quadrupole: 15.8266 -0.8110 0.1446
quadrupole: -19.0616 13.5629 5.4987 15.8266 -0.8110 0.1446
hfenergy: -1974.5971381 hartree
pointgroup: C01 [X(C17H10O7S2)]
dipole: -1.0962793 0.4861947 1.0652756 debye
polarizability: 463.4579181|-4.5210877|285.9412542|-1.0996994|-1.6944976|131.0626928 unknown
InChI: InChI=1S/C17H10O7S2/c18-17-13-3-1-2-12-15(26(22,23)24)7-6-11(16(12)13)10-5-4-9(8-14(10)17)25(19,20)21/h1-8,19,22H
charge 0 multiplicity 1
36 atoms
S  -5.130522 1.148533 -0.029443
S  5.708925 0.336235 -0.077043
O  1.468754 -3.015696 0.00914
O  -5.365852 0.60206 1.730143
O  -5.438296 2.730473 -0.157835
O  -5.915165 0.103427 -0.984675
O  5.889124 0.254621 1.769035
O  6.187736 -1.070793 -0.711326
O  6.325722 1.735723 -0.603807
C  -1.22303 -0.463393 -0.024902
C  -0.440847 0.752566 -0.038146
C  1.038999 0.667466 -0.044102
C  -0.593276 -1.755716 -0.008349
C  -2.675616 -0.406611 -0.01934
C  1.677312 -0.612905 -0.029645
C  0.889945 -1.882711 -0.008197
C  -3.259814 0.897075 -0.029343
C  -1.108662 1.991199 -0.046229
C  -2.524217 2.074784 -0.035591
C  1.862442 1.830734 -0.070139
C  -1.367979 -2.928475 0.008794
C  -3.433506 -1.622947 -0.00501
C  3.090361 -0.721707 -0.029524
C  3.837584 0.452701 -0.051111
C  -2.784419 -2.8613 0.010019
C  3.263824 1.737334 -0.070502
H  -0.548678 2.928761 -0.054944
H  -3.034287 3.042954 -0.038048
H  1.418262 2.828765 -0.087985
H  -0.843143 -3.889024 0.02079
H  -4.525587 -1.576503 -0.017453
H  3.54596 -1.71761 -0.025039
H  -3.373457 -3.783248 0.021024
H  3.899769 2.627415 -0.099864
H  -6.342472 0.668988 1.943019
H  6.858005 0.108626 1.976827
