program: Gaussian 09
title: 000153078
version: EM64L-G09RevD.01
frameworkgroup: C1[X(C17H9BrO4S)]
method: RPBEPBE
basis: SDD
operation: Freq
keyword: #p
keyword: freq=noraman
keyword: PBEPBE/SDD
title: #p freq=noraman PBEPBE/SDD
converged: YES YES NO NO
title: Mulliken charges:
elementType: Br S O O O O C C C C C C C C C C C C C C C C C H H H H H H H H H
charge: 0.050886 0.988340 -0.174571 -0.566534 -0.492141 -0.500707 0.048528 0.404861 0.304658 0.309075 0.203797 0.625679 -0.427102 -0.379346 -0.437091 -0.338956 -0.083048 -0.424616 -0.515584 -0.423278 -0.258584 -0.224016 -0.244377 0.332531 0.238373 0.239111 0.302182 0.259870 0.291640 0.257206 0.248339 0.384875
chargesum: 0.00000
title: Mulliken charges with hydrogens summed into heavy atoms:
elementType: Br S O O O O C C C C C C C C C C C C C C C C C
charge: 0.050886 0.988340 -0.174571 -0.181659 -0.492141 -0.500707 0.048528 0.404861 0.304658 0.309075 0.203797 0.625679 -0.427102 -0.046815 -0.198718 -0.099845 -0.083048 -0.122434 -0.515584 -0.163409 0.033056 0.033190 0.003962
polarizability: 4.52695006e+02 -1.32192259e-02 2.64207912e+02 1.43454372e+00 7.70110232e-01 1.03398941e+02
1716.lowfreq: -3.7725 0.0008 0.0017 0.0019 2.2021 5.3607 23.7508 29.9371 52.7541
frequency: 23.7257 29.9356 52.7521 73.2077 80.6673 121.7952 141.1802 157.5568 165.5716 171.0075 176.9056 209.2425 218.9512 254.4023 264.3146 293.9666 318.0142 329.8902 365.9209 374.5686 386.9583 418.4853 423.6934 453.1257 455.6076 469.1510 475.3040 529.4647 537.9276 557.5545 575.8787 613.2822 621.5028 643.1437 652.3075 680.7117 728.5378 782.1312 787.0738 789.0726 817.7693 835.5245 841.3352 853.7183 884.3673 926.9954 931.6158 963.4121 966.5481 968.3014 986.4489 991.4380 1016.6636 1037.6160 1048.2897 1062.2592 1079.8843 1100.0971 1134.0809 1176.4642 1186.6265 1198.1199 1219.1880 1251.4093 1278.9629 1309.9763 1345.8651 1375.2770 1388.2928 1399.0001 1412.7360 1427.6139 1449.1397 1470.4352 1512.8079 1537.3214 1568.7695 1575.7103 1585.2454 1602.8190 1618.0612 3147.3986 3154.5387 3155.7789 3159.7009 3161.4761 3174.2933 3175.4011 3181.3181 3479.8465
redmass: 9.2941 8.7410 7.1985 6.6524 11.2742 5.3419 12.4791 6.1543 12.4974 1.9147 4.0873 4.4484 4.7706 6.8953 6.1498 4.7279 8.2443 8.0226 7.6424 5.4899 8.7747 8.0316 5.0675 3.7503 6.4363 3.4939 8.2094 7.7498 6.8452 7.2223 6.1660 5.9803 4.8976 3.1529 7.3452 8.4385 3.4139 2.5397 5.4614 7.5570 1.8213 10.6785 1.3617 1.7844 6.3597 2.0996 7.0552 1.4508 1.5086 12.4361 1.4088 2.0955 1.5020 4.2942 1.2086 2.5686 2.0852 2.8907 1.7662 1.4872 1.9719 1.4482 1.5881 1.5069 3.1335 2.0234 3.2559 3.4634 4.2585 7.6989 4.5937 5.0450 2.4220 2.9020 5.2827 8.4732 7.1677 7.4104 5.8720 7.5286 7.7382 1.0870 1.0922 1.0891 1.0919 1.0886 1.0992 1.0962 1.0951 1.0661
irintensity: 1.3246 0.4300 3.5792 0.1668 0.2781 2.0355 0.1791 3.4898 0.2669 44.3953 3.3724 20.4167 9.0171 24.4290 2.0828 52.8690 8.7812 13.5905 36.5102 9.7537 3.0666 32.9870 8.6756 5.9240 21.9031 0.2782 11.6414 75.0415 28.1129 13.1845 106.8955 3.0361 0.1267 14.5478 10.6358 10.1793 0.9677 6.3526 2.3581 19.7354 43.0542 117.7426 41.3640 34.3538 3.8512 0.0665 1.3954 7.1443 0.6277 82.8322 0.3630 8.3095 4.0819 111.8110 71.3524 96.2503 4.1262 6.0417 17.2757 4.6635 10.2356 1.6545 16.6565 15.8109 73.4786 43.1626 60.7833 25.5557 8.3029 17.8760 12.6809 9.5735 50.5423 2.8493 57.7779 131.9413 163.5641 4.4151 60.4945 13.5965 18.1491 2.6120 6.1839 5.6950 0.4030 10.1663 14.8700 1.3196 7.9903 50.4911
temp: 298.150 k
press: 1.00000 atm
elementType: 35 16 8 8 8 8 6 6 6 6 6 6 6 6 6 6 6 6 6 6 6 6 6 1 1 1 1 1 1 1 1 1
symmnumber: 1
zpe: 559436.3 jmol-1
zpe.correction: 0.213078 hartree
zpe.thermalcorrener: 0.232520 hartree
zpe.thermalcorrenthalpy: 0.233464 hartree
zpe.thermalcorrgfe: 0.163534 hartree
zpe.sumelectzpe: -1363.916788 hartree
zpe.sumelectthermal: -1363.897347 hartree
zpe.sumelectthermalent: -1363.896402 hartree
zpe.sumelectthermalfe: -1363.966332 hartree
dipole: 6.0929 -2.3945 1.4111
dipole: 6.6969
quadrupole: -164.3236 -142.4842 -154.2043
quadrupole: 7.9223 -13.1781 0.5141
quadrupole: -10.6529 11.1865 -0.5336 7.9223 -13.1781 0.5141
hfenergy: -1364.1298663 hartree
pointgroup: C01 [X(C17H9Br1O4S1)]
dipole: -2.2894471 1.184271 0.54583 debye
polarizability: 450.648183|-19.5566737|266.2629784|0.6743049|0.0287096|103.3906985 unknown
InChI: InChI=1S/C17H9BrO4S/c18-15-7-6-11-10-5-4-9(23(20,21)22)8-14(10)17(19)13-3-1-2-12(15)16(11)13/h1-8,20H
charge 0 multiplicity 1
32 atoms
Br -5.86883 1.74326 0.016341
S  4.973408 0.03543 -0.071278
O  0.454681 -2.935272 -0.021518
O  5.167406 -0.091101 1.771794
O  5.333977 -1.397361 -0.726719
O  5.707068 1.385388 -0.581462
C  -2.000225 -0.150459 -0.00857
C  -1.112189 0.987123 -0.009968
C  0.351295 0.772911 -0.018583
C  -1.487096 -1.494778 -0.013799
C  0.875888 -0.55939 -0.023728
C  -3.441597 0.037299 -0.001084
C  -0.020403 -1.753387 -0.019756
C  2.274464 -0.792541 -0.028263
C  -1.676932 2.276609 -0.002018
C  1.276357 1.858638 -0.029211
C  3.122309 0.311198 -0.035616
C  -2.360275 -2.597036 -0.013033
C  -3.941536 1.384381 0.005844
C  -4.295397 -1.111111 -0.000737
C  2.663037 1.642375 -0.034419
C  -3.081147 2.482321 0.005829
C  -3.764655 -2.405716 -0.006791
H  2.639833 -1.824881 -0.038926
H  -1.041423 3.165897 -0.00109
H  0.920279 2.891586 -0.031289
H  -1.920538 -3.599502 -0.017254
H  -5.379155 -0.961339 0.004388
H  3.375337 2.472895 -0.052728
H  -3.481775 3.498971 0.011881
H  -4.434378 -3.271047 -0.006617
H  6.121914 -0.329661 1.95988
