program: Gaussian 09
title: 000153076
version: EM64L-G09RevD.01
frameworkgroup: C1[X(C23H28N2O2)]
method: RPBEPBE
basis: SDD
operation: Freq
keyword: #p
keyword: freq=noraman
keyword: PBEPBE/SDD
title: #p freq=noraman PBEPBE/SDD
converged: YES YES NO NO
title: Mulliken charges:
elementType: O O N N C C C C C C C C C C C C C C C C C C C C C C C H H H H H H H H H H H H H H H H H H H H H H H H H H H H
charge: -0.308381 -0.198564 -0.116788 -0.421503 -0.070408 -0.371252 -0.415717 -0.372013 -0.759743 0.311996 -0.311522 -0.316904 0.048736 0.332698 -0.371666 -0.109884 0.287938 0.261693 -0.272564 -0.675798 -0.678399 -0.442340 -0.234474 -0.385694 -0.379657 -0.228625 -0.230449 0.215491 0.254687 0.189176 0.211837 0.210696 0.192921 0.196640 0.372846 0.230018 0.218919 0.232712 0.203924 0.184778 0.210676 0.185816 0.247733 0.207581 0.206060 0.223255 0.208182 0.203923 0.238719 0.292477 0.234102 0.291687 0.290236 0.236521 0.237669
chargesum: 0.00000
title: Mulliken charges with hydrogens summed into heavy atoms:
elementType: O O N N C C C C C C C C C C C C C C C C C C C C C C C
charge: -0.308381 -0.198564 -0.116788 -0.048656 0.145083 0.072610 0.006815 0.017549 -0.078094 0.311996 0.077180 0.079588 0.048736 0.332698 -0.123933 -0.109884 0.287938 0.261693 -0.272564 -0.038902 -0.027576 -0.149862 -0.000371 -0.094008 -0.089421 0.007896 0.007220
polarizability: 3.79780408e+02 -3.38588925e+01 2.64221621e+02 -7.18373099e+01 -4.17778912e+01 2.33855343e+02
1716.lowfreq: -17.7154 -13.2639 -10.8526 -7.9821 0.0006 0.0007 0.0008 10.2357 19.4916
frequency: -16.0204 5.5096 19.2116 34.6271 47.6117 61.5296 68.2968 77.8337 98.8764 105.5060 124.3850 138.0152 173.7595 176.5616 192.1243 202.4648 204.7038 213.1994 229.8032 236.5553 246.3222 276.3136 288.7725 296.6571 317.7585 328.6120 347.3863 384.2319 391.9458 412.0898 421.5421 422.9072 425.8724 459.3661 465.0411 469.3858 489.6161 493.8071 549.1477 598.2593 613.6056 626.1104 660.7827 666.5959 685.1644 696.4083 717.2563 733.7539 771.6057 774.6719 791.9568 794.6450 795.4676 800.4160 809.2400 849.6733 854.0869 864.5826 891.6272 906.2028 914.2861 914.7948 924.3807 943.8124 949.4332 990.6109 993.5744 996.9873 999.1228 1013.2000 1027.0934 1036.9805 1046.5751 1071.8059 1072.5827 1077.3234 1083.1885 1085.0249 1089.4768 1109.4310 1122.9132 1153.9565 1163.7667 1167.8191 1176.3062 1182.4170 1197.9197 1202.1133 1220.0502 1243.4547 1249.4854 1280.3917 1281.9015 1288.2775 1290.0664 1295.5792 1301.7331 1323.8682 1331.6449 1349.0690 1357.6491 1362.4061 1364.6972 1378.4810 1385.8498 1387.8314 1388.8452 1390.9409 1393.7015 1416.0958 1428.8503 1446.4248 1454.3332 1460.2679 1462.1417 1467.8350 1470.0772 1472.4053 1473.2941 1477.9807 1480.6564 1480.8881 1486.5123 1490.5275 1497.8844 1532.5321 1549.2858 1580.1797 1588.5009 1608.7824 1618.6027 2848.1642 2851.2669 2864.6678 2957.9422 2974.5542 2978.3938 2981.4140 2982.2945 2987.2364 3015.8618 3028.1795 3031.5531 3034.1593 3046.9730 3073.7679 3075.4608 3082.8520 3087.6290 3089.3908 3091.4901 3133.9677 3137.5810 3150.4532 3163.2104 3168.2025 3171.6042 3177.0295 3193.9634
redmass: 3.4381 4.2169 5.4659 3.9838 4.3650 6.5611 2.7890 1.8990 3.1665 3.0595 2.9729 3.6402 4.4065 2.4546 1.7272 1.6246 1.8074 1.6445 2.2800 2.6729 3.6804 3.6974 1.8704 2.3188 3.3377 3.6118 4.3313 4.1188 3.6204 10.9604 3.0079 4.0410 3.7368 2.6061 4.0688 9.6739 3.7143 3.2351 4.2379 6.5128 3.6146 4.4342 3.7104 6.2131 6.4399 2.2136 2.7347 2.2904 1.7068 3.4423 1.3840 1.5094 1.2803 2.1125 1.8260 1.3505 2.2506 2.4192 2.4183 6.1157 1.4990 1.7864 1.8638 2.0972 2.5292 1.3773 1.9008 1.4022 1.7570 1.3651 2.2004 2.1488 2.3347 1.8482 2.0911 2.2899 2.2234 2.4880 2.0294 1.9383 2.0261 2.1918 1.9490 1.2402 1.8782 1.4247 2.1245 1.7518 1.5097 1.5584 1.6629 1.1529 1.1870 2.1002 1.4378 1.2232 2.4971 1.3132 1.7912 1.8841 1.4065 1.3276 1.3679 1.3785 1.2438 1.3763 1.3328 2.5724 4.9182 5.3370 4.3182 2.8224 1.0769 1.0594 1.0550 1.0843 2.5744 1.0591 1.0687 1.0662 1.0591 1.0663 1.0713 1.0759 4.8505 5.1109 4.5088 4.0360 3.6296 6.6669 7.2007 1.0722 1.0719 1.0710 1.0777 1.0671 1.0599 1.0358 1.0359 1.0365 1.0930 1.0887 1.0912 1.0877 1.1013 1.0985 1.0979 1.0997 1.1003 1.1003 1.0999 1.0862 1.0878 1.0905 1.0946 1.0917 1.0994 1.0969 1.0817
irintensity: 0.0516 0.0763 0.1795 0.8450 0.3120 5.0622 0.1759 0.3867 0.0580 0.2256 0.0642 0.1805 0.2527 0.0770 3.0494 0.2237 0.0606 0.1615 0.5616 0.1072 1.8369 0.2317 2.1268 0.6759 1.0643 0.8460 1.2216 10.8226 5.7498 12.3359 1.0385 1.3352 2.6028 3.9065 0.7555 4.3356 1.5520 7.2990 5.5213 2.9113 1.6919 1.3696 8.4763 5.3513 4.6943 7.7245 47.0662 18.4914 10.8435 4.8705 4.9713 10.7172 10.6845 11.8191 90.8750 59.5014 30.6215 3.5978 4.3443 0.9097 1.4082 3.5666 3.8952 1.5044 18.7177 0.6400 9.6650 6.9513 13.3318 0.0059 19.8568 5.7487 8.1552 17.0313 31.8021 9.1590 2.7111 4.2125 14.4373 5.8051 5.2829 26.4094 9.3343 5.5273 12.8718 11.2478 38.3163 4.8766 31.2905 16.8936 1.3793 0.1492 2.6659 184.6322 2.3183 38.7792 175.3677 4.1821 299.0624 84.1553 4.4352 6.2946 3.2909 4.1939 19.1478 13.9892 52.8963 7.3793 8.7600 12.9282 10.7584 0.2710 0.1214 4.3208 6.5736 7.0108 2.4830 4.5606 9.2789 8.6324 14.9325 17.1924 13.4746 12.5781 108.4209 166.8844 128.1564 42.5227 179.8422 25.3576 41.0615 35.9466 30.2313 281.7676 15.6104 39.4796 35.6224 39.6291 18.9210 27.4458 7.5699 5.3771 16.0390 12.9124 94.2813 25.3879 86.1445 35.9003 40.4418 47.0532 38.0784 4.2850 13.7334 10.6797 3.7604 1.2047 35.6490 14.6742 45.3414
temp: 298.150 k
press: 1.00000 atm
elementType: 8 8 7 7 6 6 6 6 6 6 6 6 6 6 6 6 6 6 6 6 6 6 6 6 6 6 6 1 1 1 1 1 1 1 1 1 1 1 1 1 1 1 1 1 1 1 1 1 1 1 1 1 1 1 1
symmnumber: 1
zpe: 1206407.6 jmol-1
zpe.correction: 0.459496 hartree
zpe.thermalcorrener: 0.484882 hartree
zpe.thermalcorrenthalpy: 0.485826 hartree
zpe.thermalcorrgfe: 0.402148 hartree
zpe.sumelectzpe: -1151.232638 hartree
zpe.sumelectthermal: -1151.207252 hartree
zpe.sumelectthermalent: -1151.206308 hartree
zpe.sumelectthermalfe: -1151.289986 hartree
dipole: -3.2489 1.6788 -0.8499
dipole: 3.7545
quadrupole: -147.3772 -164.2263 -155.5566
quadrupole: 4.2551 -13.1955 2.0499
quadrupole: 8.3428 -8.5063 0.1634 4.2551 -13.1955 2.0499
hfenergy: -1151.6921341 hartree
pointgroup: C01 [X(C23H28N2O2)]
dipole: -1.2831631 -0.1356729 0.7190473 debye
polarizability: 396.4142633|48.6433827|195.7984143|27.2114438|-27.856016|285.644695 unknown
InChI: InChI=1S/C23H28N2O2/c1-4-25(5-2)15-9-10-16(3)24-20-14-8-13-19-21(20)23(27)18-12-7-6-11-17(18)22(19)26/h6-8,11-14,16,24H,4-5,9-10,15H2,1-3H3
charge 0 multiplicity 1
55 atoms
O  1.116083 -1.393119 1.835298
O  3.617165 0.666821 -2.644502
N  -3.579002 1.978917 0.493995
N  -1.060612 -1.821966 0.455074
C  -2.466745 -2.27632 0.500799
C  -3.462366 -1.07935 0.560109
C  -3.306471 -0.172965 1.799969
C  -4.065586 1.166765 1.641263
C  -2.624576 -3.241966 1.694532
C  -0.416302 -1.291325 -0.633898
C  -4.614219 2.912233 -0.027676
C  -2.287808 2.663836 0.784493
C  0.962002 -0.836057 -0.516688
C  1.620013 -0.298984 -1.67633
C  -1.065863 -1.177146 -1.911895
C  1.670867 -0.918688 0.762686
C  3.082798 -0.439646 0.836226
C  3.744115 0.093732 -0.306758
C  3.036388 0.188067 -1.616159
C  -5.687773 2.210346 -0.881634
C  -1.47041 2.971413 -0.485101
C  0.953304 -0.210881 -2.912001
C  -0.388978 -0.654139 -3.018977
C  3.77617 -0.520599 2.06969
C  5.085657 0.538932 -0.203403
C  5.109932 -0.076719 2.165251
C  5.767686 0.455074 1.025872
H  -2.679535 -2.847477 -0.427238
H  -3.330894 -0.437586 -0.331693
H  -4.493336 -1.487506 0.516207
H  -2.23084 0.028388 1.972516
H  -3.683256 -0.67804 2.711608
H  -5.136625 0.945244 1.473529
H  -4.006344 1.739417 2.60169
H  -0.476902 -1.846318 1.31671
H  -2.363411 -2.747096 2.647546
H  -3.670051 -3.589369 1.767527
H  -1.971712 -4.1248 1.576871
H  -4.103782 3.662601 -0.658191
H  -5.104658 3.481203 0.803653
H  -1.688072 1.997953 1.431147
H  -2.453331 3.604466 1.369579
H  -2.102968 -1.503661 -2.020908
H  -6.414644 2.947743 -1.271059
H  -6.253805 1.458933 -0.301353
H  -5.214672 1.694592 -1.735755
H  -0.514179 3.459806 -0.219487
H  -2.010612 3.647763 -1.172439
H  -1.248843 2.037421 -1.030599
H  1.493726 0.204095 -3.767243
H  -0.909615 -0.58377 -3.980301
H  3.245447 -0.935298 2.931881
H  5.564448 0.943572 -1.10071
H  5.640987 -0.142378 3.121101
H  6.804607 0.799238 1.103277
