program: Gaussian 09
title: 000153065
version: EM64L-G09RevD.01
frameworkgroup: C1[X(C23H15BrN2O5)]
method: RPBEPBE
basis: SDD
operation: Freq
keyword: #p
keyword: freq=noraman
keyword: PBEPBE/SDD
title: #p freq=noraman PBEPBE/SDD
converged: YES YES NO NO
title: Mulliken charges:
elementType: Br O O O O O N N C C C C C C C C C C C C C C C C C C C C C C C H H H H H H H H H H H H H H H
charge: 0.074092 -0.293532 -0.173791 -0.220667 -0.199856 -0.223471 -0.457863 0.022943 0.053451 0.432338 0.188786 0.282143 0.372495 -0.119291 0.271086 -0.212814 -0.459450 -0.356807 -0.374127 -0.375955 -0.824289 -0.706428 0.209650 0.484064 -0.227440 -0.224398 0.231177 -0.403387 -0.370859 -0.226456 -0.215458 0.265938 0.385896 0.291854 0.295764 0.265502 0.289932 0.226911 0.246948 0.282101 0.241757 0.242760 0.241196 0.284049 0.239806 0.243698
chargesum: 0.00000
title: Mulliken charges with hydrogens summed into heavy atoms:
elementType: Br O O O O O N N C C C C C C C C C C C C C C C C C C C C C C C
charge: 0.074092 -0.293532 -0.173791 -0.220667 -0.199856 -0.223471 -0.071967 0.022943 0.053451 0.432338 0.188786 0.282143 0.372495 -0.119291 0.271086 -0.212814 -0.459450 -0.090869 -0.082273 -0.080190 -0.041944 -0.177380 0.209650 0.484064 0.014318 0.018362 0.231177 -0.162190 -0.086810 0.013350 0.028240
polarizability: 4.88665947e+02 3.31215835e+01 3.84139741e+02 1.25579257e+01 -8.19342133e+00 1.54049261e+02
1716.lowfreq: -0.0005 -0.0004 -0.0002 1.0887 2.4510 5.0087 14.8454 21.0965 25.9025
frequency: 14.6094 21.0828 25.8894 28.1983 40.9817 46.3060 70.8575 89.0828 109.2185 124.8673 134.6600 136.8941 152.2450 159.6605 173.9340 190.1080 229.9144 234.3192 246.1973 260.2710 270.8684 291.5276 308.5971 326.2345 341.0578 349.0466 364.6967 378.3003 408.7971 419.6940 423.4043 427.1711 438.0473 470.9434 477.4437 484.1960 507.1199 520.8001 549.6849 563.3913 582.0959 596.4686 634.8056 643.6731 660.5905 670.4001 677.2868 696.7405 707.0576 730.4362 733.6046 762.7677 767.0462 771.4283 784.0595 799.2753 810.5036 849.5878 856.5920 864.6121 879.1630 886.6768 902.5555 928.4628 934.5609 939.6337 973.9137 997.5341 999.2291 1000.7132 1004.5514 1016.5102 1040.1556 1043.6532 1045.9324 1061.4396 1065.8342 1095.5781 1137.5880 1166.4533 1170.5001 1175.2009 1182.9719 1197.0580 1205.6197 1214.3641 1217.8070 1250.7769 1277.0428 1283.8800 1295.5117 1300.4404 1318.9718 1343.2201 1361.9266 1363.6191 1390.5493 1401.3791 1404.8283 1410.0419 1435.6115 1441.8030 1442.7113 1449.0037 1468.4967 1476.7104 1479.2313 1483.9987 1510.7405 1552.9230 1563.8994 1579.3186 1584.0293 1602.6394 1609.9402 1613.5462 1647.3506 2988.4223 2995.8592 3065.4901 3074.0012 3093.7133 3111.7340 3135.7155 3139.4898 3151.5921 3155.6898 3156.7334 3168.2349 3168.4635 3176.2677 3187.0412
redmass: 6.8682 8.0288 8.3867 10.6362 7.3490 6.7270 7.3761 8.2864 5.4404 5.9153 7.9926 9.3784 6.5415 6.1176 7.7105 4.7379 2.4031 1.7098 6.1850 5.8339 5.3341 4.8664 3.5296 7.1091 3.3570 6.0653 6.6505 8.4897 7.6172 3.4073 3.4963 8.6563 5.0444 9.7019 6.1272 4.8605 4.0496 4.0703 5.1502 5.0070 5.7727 5.4384 6.2775 6.1252 6.0606 5.0509 5.0335 8.0405 3.7509 2.7516 3.8530 6.9672 4.7542 6.4953 1.5247 4.9900 2.0644 3.1609 1.9559 2.7427 2.7964 2.2018 1.3684 2.3919 2.0758 2.7859 1.3990 2.8289 1.3930 1.3507 3.7271 1.3669 1.9870 2.8069 1.7025 2.3075 3.0197 2.0245 1.8887 3.0605 1.1704 1.0942 2.1764 1.1748 2.6490 3.7866 4.0444 1.7092 1.5502 2.9884 2.7495 3.0636 1.6854 5.5564 6.4909 6.8941 6.4654 2.9903 2.1872 3.1534 2.0285 1.6069 1.7583 1.2244 3.2070 2.5132 1.2015 3.0239 4.6779 7.5325 5.0197 3.7774 5.2579 7.3155 7.0196 6.8050 3.2473 1.0365 1.0622 1.0967 1.0964 1.1007 1.0809 1.0877 1.0866 1.0910 1.0908 1.0924 1.0946 1.0960 1.0995 1.0972
irintensity: 0.5878 1.1022 2.2281 1.4729 0.7022 0.2340 4.3638 1.2893 2.0546 0.6959 1.3426 0.5714 0.2256 1.2503 0.6379 1.4764 0.8469 0.7987 3.2920 5.2642 7.2818 4.8853 2.6422 3.1380 2.3816 0.8693 5.8828 7.3881 11.7470 1.6375 0.8412 11.9285 1.5099 1.9066 0.4968 3.7452 7.9867 2.4790 1.0014 15.1374 3.6835 12.5353 9.9128 2.7248 13.7012 19.3080 13.3051 5.3151 22.0624 30.3920 12.1105 11.7844 31.1274 34.4469 43.7673 6.2976 39.1692 23.7476 32.1848 11.1876 9.9303 7.5031 14.2985 9.2321 7.0853 12.5468 6.4726 55.3972 3.8136 0.8848 109.1740 0.2072 10.6427 9.7869 3.8912 44.8154 8.5192 5.2832 6.6709 113.8376 0.3270 7.0737 35.9621 4.1133 38.8031 186.1169 78.6425 31.1050 35.6463 303.8310 532.6138 40.2324 33.1588 109.6847 182.4039 126.8031 9.6597 6.0487 35.7410 40.3844 3.3792 92.9454 1.6562 31.8853 214.2394 74.6021 48.4880 495.1113 233.5191 69.3341 29.0122 185.7269 48.3260 12.9062 3.8654 12.1602 36.2191 8.5541 16.2633 1.3783 1.1043 17.4161 271.3980 3.3892 3.9183 11.7040 9.1924 3.0538 2.0506 14.6983 27.0049 8.4612
temp: 298.150 k
press: 1.00000 atm
elementType: 35 8 8 8 8 8 7 7 6 6 6 6 6 6 6 6 6 6 6 6 6 6 6 6 6 6 6 6 6 6 6 1 1 1 1 1 1 1 1 1 1 1 1 1 1 1
symmnumber: 1
zpe: 861344.8 jmol-1
zpe.correction: 0.328069 hartree
zpe.thermalcorrener: 0.354135 hartree
zpe.thermalcorrenthalpy: 0.355079 hartree
zpe.thermalcorrgfe: 0.268505 hartree
zpe.sumelectzpe: -1382.351280 hartree
zpe.sumelectthermal: -1382.325214 hartree
zpe.sumelectthermalent: -1382.324270 hartree
zpe.sumelectthermalfe: -1382.410844 hartree
dipole: -2.3498 6.0833 -0.9676
dipole: 6.5927
quadrupole: -164.9027 -167.7222 -193.5346
quadrupole: -0.2394 13.8050 -3.0835
quadrupole: 10.4838 7.6643 -18.1480 -0.2394 13.8050 -3.0835
hfenergy: -1382.679349 hartree
pointgroup: C01 [X(C23H15Br1N2O5)]
dipole: 0.6674387 2.5025564 -0.1393441 debye
polarizability: 494.6015801|-18.8569169|372.7432086|13.819004|-36.248163|159.5101595 unknown
InChI: InChI=1S/C23H15BrN2O5/c1-12-10-16(24)19-20(23(29)15-8-4-3-7-14(15)22(19)28)21(12)25-18(27)11-13-6-2-5-9-17(13)26(30)31/h2-10,25H,11H2,1H3
charge 0 multiplicity 1
46 atoms
Br -4.0473 -3.825729 1.27849
O  -1.185049 1.718907 -1.182954
O  -5.39753 -1.304735 0.663546
O  2.134504 -0.59764 1.164486
O  5.306356 -2.301171 -0.744146
O  3.523822 -1.222933 -1.648101
N  0.531068 -0.045362 -0.477289
N  4.579827 -1.246823 -0.8979
C  -1.882567 -0.382479 -0.168747
C  -3.001085 -1.201054 0.251633
C  -0.535375 -0.900532 -0.12918
C  -3.492896 1.569039 -0.610288
C  -0.303414 -2.282865 0.177947
C  -2.126427 0.999253 -0.668569
C  -4.582731 0.786729 -0.149511
C  -4.391013 -0.632249 0.279651
C  -2.720438 -2.534484 0.647671
C  -1.410397 -3.055235 0.575037
C  -3.708782 2.906883 -1.030424
C  -5.882808 1.347734 -0.107707
C  1.033252 -2.962748 0.001621
C  2.664681 1.137726 -0.517548
C  1.781608 0.055313 0.145557
C  4.106605 1.106039 -0.052409
C  -5.002093 3.460383 -0.982115
C  -6.092139 2.678651 -0.518516
C  4.990745 -0.002167 -0.201011
C  4.630423 2.239512 0.617517
C  6.317609 0.01697 0.289128
C  5.955668 2.283465 1.10071
C  6.805417 1.16553 0.937177
H  -1.248845 -4.110171 0.816158
H  0.204289 0.782407 -1.02782
H  -2.851271 3.483789 -1.388271
H  -6.704985 0.719206 0.247415
H  1.57982 -2.568181 -0.873357
H  1.685563 -2.785066 0.874911
H  0.895984 -4.049369 -0.12794
H  2.230931 2.126069 -0.269809
H  2.597353 1.00819 -1.61136
H  -5.168043 4.494108 -1.303022
H  -7.097822 3.110641 -0.482596
H  3.974529 3.104057 0.768123
H  6.939417 -0.871335 0.152284
H  6.319383 3.182787 1.608633
H  7.833355 1.18714 1.311993
