program: Gaussian 09
title: 000153060
version: EM64L-G09RevD.01
frameworkgroup: C1[X(C18H25Cl2NO)]
method: RPBEPBE
basis: SDD
operation: Freq
keyword: #p
keyword: freq=noraman
keyword: PBEPBE/SDD
title: #p freq=noraman PBEPBE/SDD
converged: NO YES NO NO
title: Mulliken charges:
elementType: Cl Cl O N C C C C C C C C C C C C C C C C C C H H H H H H H H H H H H H H H H H H H H H H H H H
charge: -0.043938 -0.028066 -0.212950 -0.080001 -0.181008 -0.419203 -0.376727 -0.419568 -0.353057 0.128683 -0.359595 -0.622575 -0.615045 -0.299915 -0.698310 -0.235644 0.643110 -0.299819 -0.305721 -0.244639 -0.244866 -0.213814 0.207755 0.230254 0.215509 0.213844 0.175625 0.228411 0.213953 0.184781 0.193821 0.191759 0.197944 0.224106 0.189882 0.228787 0.231019 0.189492 0.221953 0.256137 0.213234 0.211381 0.208526 0.277749 0.264379 0.265919 0.246447
chargesum: 0.00000
title: Mulliken charges with hydrogens summed into heavy atoms:
elementType: Cl Cl O N C C C C C C C C C C C C C C C C C C
charge: -0.043938 -0.028066 -0.212950 -0.080001 0.026747 0.026561 0.012741 0.022796 0.025545 0.128683 0.030107 0.020201 0.027419 -0.043777 -0.065169 0.042104 0.643110 -0.299819 -0.305721 0.019740 0.021053 0.032633
polarizability: 3.27378219e+02 1.99931964e+01 2.46308244e+02 2.42974557e+01 -2.39605725e+01 1.56305258e+02
1716.lowfreq: -18.7593 -2.6397 0.0028 0.0031 0.0032 3.3668 4.9469 9.4110 16.8378
frequency: -17.7050 9.1227 16.3957 27.8911 37.6684 40.5571 51.5600 64.6201 82.3219 92.0111 110.8870 120.7050 124.3417 144.3593 177.2958 189.5438 191.9769 204.6418 222.5793 225.5236 225.9385 236.6176 268.5522 280.4976 304.8926 308.5712 346.2783 363.5379 368.6621 396.2787 399.2390 432.7846 463.7151 497.8556 521.0336 524.9492 546.4095 594.4018 660.3066 684.3415 724.1478 725.9694 732.6282 756.0528 779.0334 805.1253 820.7448 857.5875 867.9258 889.5614 899.2802 900.2666 917.5459 969.3946 974.2015 987.4401 1009.1011 1024.1522 1030.9106 1041.3340 1045.2742 1046.2548 1066.5738 1074.3076 1080.6001 1088.2821 1089.5537 1118.0659 1129.9412 1146.2933 1151.7040 1169.9776 1176.9981 1203.2260 1232.2111 1240.6899 1251.5845 1260.1479 1265.1338 1283.1120 1288.2607 1290.7314 1301.9879 1310.0356 1321.4080 1343.8277 1348.0812 1356.4388 1359.8913 1367.7732 1387.1910 1414.5818 1416.4755 1425.7207 1439.5649 1456.4413 1460.5053 1462.3878 1462.5482 1468.5457 1473.0339 1475.8324 1476.0516 1478.1342 1484.8972 1486.9512 1549.4838 1559.9561 1586.5560 1643.4428 2829.4877 2845.7410 2863.4119 2949.4232 2954.8139 2962.6544 2966.3966 2970.0917 2986.5181 2991.6929 3008.1003 3020.3795 3024.6157 3027.1373 3029.8911 3053.6509 3067.0308 3068.1332 3078.7969 3082.7498 3106.5918 3155.4949 3169.6451 3174.6805 3186.0125
redmass: 2.6238 8.0821 5.2828 3.9299 4.0549 1.6281 6.2808 5.9059 4.2989 3.2063 2.9574 2.0861 3.7927 4.7094 2.7169 3.0845 3.7404 1.6344 2.9379 1.2074 1.2944 4.6410 2.3327 4.7472 3.9068 4.0060 3.2082 2.6357 9.3158 4.2585 3.7764 2.4454 3.6512 3.4369 3.4433 5.0737 4.1217 6.4778 3.8178 2.8599 1.8772 1.9340 3.5972 1.3606 1.4453 3.5310 2.5062 1.7310 2.4470 2.1441 1.3529 1.7083 2.2900 1.3411 1.4189 3.7700 1.1299 2.6868 1.5853 3.5405 4.3719 2.5243 2.7019 2.1579 2.1785 1.3270 1.5462 1.8146 1.7647 1.7463 1.9274 1.9458 1.2656 1.5425 2.0506 1.4273 1.4883 1.9870 1.5419 1.2678 1.1367 1.2678 1.2833 1.3639 1.5288 1.5360 1.4625 1.6669 2.9300 1.4598 1.2194 2.4495 1.1477 2.9494 1.1541 1.0763 1.0506 1.0732 1.0722 1.0762 1.0802 1.0429 1.0530 1.0752 1.0531 1.0843 6.3370 8.4046 7.6694 5.9936 1.0694 1.0571 1.0573 1.0610 1.0596 1.0798 1.0593 1.0370 1.0619 1.0934 1.0998 1.0727 1.0854 1.0750 1.1034 1.1034 1.1007 1.0993 1.1010 1.1006 1.0876 1.0876 1.0913 1.0931 1.1000
irintensity: 0.2582 0.0371 0.8867 1.1643 0.3846 0.2678 0.2845 0.3735 2.2524 0.0864 0.8244 0.0959 0.0874 0.3408 0.3804 0.2967 0.1356 0.3256 0.1410 0.3436 0.5002 1.1457 9.2874 2.1334 5.9226 4.2539 6.2817 5.6648 8.6359 3.8942 4.1172 3.7973 5.3453 0.7209 1.5622 0.9603 1.4014 12.9161 4.8026 4.3857 61.6001 17.9477 17.4069 5.7862 55.4673 11.3346 10.5563 3.9582 1.4713 2.9653 0.0160 6.6513 6.0116 0.9873 1.3095 1.2261 39.9729 44.3316 25.1559 60.9061 30.0728 29.7712 23.3003 10.7515 17.2339 5.2955 40.5701 24.9399 3.2109 15.6172 28.1400 31.1667 15.5327 5.2267 2.7347 11.6161 1.3953 11.3610 6.8758 28.0908 14.6195 56.7420 45.2660 7.5471 4.5482 7.5279 0.9922 0.6405 39.0260 22.1265 11.3354 55.3854 4.8441 28.7181 1.5060 9.5968 22.3926 2.7647 3.2703 3.5228 15.9407 10.5476 23.9567 6.4236 15.6262 18.6436 41.3282 163.8810 8.2329 77.0085 108.3114 75.2270 215.7342 4.4193 11.6781 14.5268 84.4992 37.6196 35.7494 11.0702 1.4989 44.6974 39.0165 31.5149 37.4535 36.9197 94.5616 56.3844 20.8798 58.6914 0.6411 1.9772 2.2411 0.7531 7.2206
temp: 298.150 k
press: 1.00000 atm
elementType: 17 17 8 7 6 6 6 6 6 6 6 6 6 6 6 6 6 6 6 6 6 6 1 1 1 1 1 1 1 1 1 1 1 1 1 1 1 1 1 1 1 1 1 1 1 1 1
symmnumber: 1
zpe: 1015994.9 jmol-1
zpe.correction: 0.386972 hartree
zpe.thermalcorrener: 0.411552 hartree
zpe.thermalcorrenthalpy: 0.412496 hartree
zpe.thermalcorrgfe: 0.328084 hartree
zpe.sumelectzpe: -1749.285001 hartree
zpe.sumelectthermal: -1749.260422 hartree
zpe.sumelectthermalent: -1749.259477 hartree
zpe.sumelectthermalfe: -1749.343889 hartree
dipole: -3.4001 2.6399 -2.3029
dipole: 4.8819
quadrupole: -125.6053 -144.6785 -150.7555
quadrupole: 6.8053 4.0162 2.1946
quadrupole: 14.7411 -4.3320 -10.4091 6.8053 4.0162 2.1946
hfenergy: -1749.6719733 hartree
pointgroup: C01 [X(C18H25Cl2N1O1)]
dipole: 1.3428853 -0.7886786 -1.1241365 debye
polarizability: 326.577197|26.3532648|231.672147|-20.2740566|41.0659986|171.7423779 unknown
InChI: InChI=1S/C18H25Cl2NO/c1-4-5-6-8-14(13-21(2)3)18(22)12-11-15-16(19)9-7-10-17(15)20/h7,9-12,14H,4-6,8,13H2,1-3H3
charge 0 multiplicity 1
47 atoms
Cl 2.974036 -1.959298 -1.43273
Cl 3.442891 2.825897 1.588725
O  -0.749323 0.579315 1.740287
N  -2.601019 -3.14774 -0.43042
C  -1.765792 -0.783692 -0.033431
C  -3.142503 -0.204563 0.348415
C  -3.416201 1.185455 -0.267667
C  -1.653924 -2.301937 0.329944
C  -4.797506 1.755676 0.125044
C  -0.598562 -0.057912 0.654239
C  -5.085157 3.141328 -0.495992
C  -2.21783 -3.323822 -1.844791
C  -2.854007 -4.441647 0.237604
C  0.737036 -0.186748 -0.007716
C  -6.463621 3.709698 -0.094208
C  1.836252 0.426602 0.529295
C  3.225353 0.461439 0.051918
C  3.86216 -0.487392 -0.80997
C  4.091584 1.517625 0.492064
C  5.208801 -0.398774 -1.206754
C  5.438065 1.642556 0.112859
C  6.0000 0.67479 -0.746678
H  -1.612088 -0.684046 -1.129416
H  -3.914981 -0.927066 0.022299
H  -3.196937 -0.127539 1.452186
H  -2.628046 1.894776 0.056257
H  -3.351261 1.118785 -1.375176
H  -1.888993 -2.405492 1.406349
H  -0.596434 -2.648759 0.19104
H  -5.592077 1.0437 -0.183121
H  -4.859183 1.831387 1.230678
H  -5.022925 3.065245 -1.601193
H  -4.288382 3.849004 -0.188339
H  -2.982678 -3.930856 -2.360744
H  -1.22726 -3.832844 -1.97016
H  -2.167842 -2.347186 -2.356518
H  -3.229062 -4.265182 1.261076
H  -1.946514 -5.094147 0.30779
H  -3.629477 -4.998643 -0.318645
H  0.776575 -0.758996 -0.938174
H  -6.64473 4.699932 -0.551967
H  -6.538502 3.826135 1.003642
H  -7.279533 3.034333 -0.414922
H  1.637884 1.015051 1.436315
H  5.630426 -1.164281 -1.863231
H  6.033328 2.481463 0.482075
H  7.047458 0.753775 -1.052638
