program: Gaussian 09
title: 000153052
version: EM64L-G09RevD.01
frameworkgroup: C1[X(C16H18N4O2)]
method: RPBEPBE
basis: SDD
operation: Freq
keyword: #p
keyword: freq=noraman
keyword: PBEPBE/SDD
title: #p freq=noraman PBEPBE/SDD
converged: YES YES NO NO
title: Mulliken charges:
elementType: O O N N N N C C C C C C C C C C C C C C C C H H H H H H H H H H H H H H H H H H
charge: -0.260907 -0.260773 -0.052454 -0.049924 0.049849 0.048007 -0.389140 -0.389585 -0.558744 -0.559675 0.475011 0.481258 -0.402033 -0.408427 -0.367689 -0.369301 -0.230789 -0.230068 -0.222392 -0.223611 -0.243384 -0.243207 0.244063 0.282011 0.279739 0.245300 0.225842 0.256298 0.226865 0.257125 0.239249 0.238218 0.256721 0.255930 0.231094 0.231864 0.234446 0.234935 0.233822 0.234456
chargesum: 0.00000
title: Mulliken charges with hydrogens summed into heavy atoms:
elementType: O O N N N N C C C C C C C C C C C C C C C C
charge: -0.260907 -0.260773 -0.052454 -0.049924 0.049849 0.048007 0.136933 0.135455 -0.076604 -0.075685 0.475011 0.481258 -0.162784 -0.170209 -0.110968 -0.113371 0.000306 0.001796 0.012053 0.011324 -0.009562 -0.008751
polarizability: 1.82119813e+02 2.08916362e+00 2.45681273e+02 -2.77362666e+01 1.38625674e+00 1.70264315e+02
1716.lowfreq: -3.1472 -0.0005 -0.0005 0.0006 2.4843 8.3697 15.2481 16.9641 29.7206
frequency: 14.6591 16.2941 29.3850 31.2687 42.4552 49.5817 51.8147 63.5301 68.2736 141.4023 141.8557 221.0248 233.9104 256.7858 260.4633 283.8562 319.0390 337.0831 353.7523 374.6065 380.2486 404.0302 404.2911 452.4546 454.0295 466.1730 487.5651 579.9473 582.0780 616.1669 616.5246 670.7540 673.6002 708.5474 708.8880 745.1490 761.6985 789.4546 808.2108 808.6260 822.3619 857.2612 861.6567 882.7816 901.9397 905.0318 936.5771 940.3957 967.8794 982.6270 983.2434 989.7587 990.0242 1001.1643 1001.5587 1011.0444 1024.3587 1026.7993 1035.1695 1080.7701 1090.3863 1119.6243 1151.6737 1173.1904 1173.9022 1187.1959 1189.8578 1204.0847 1207.6298 1233.9139 1270.1837 1274.3358 1312.4947 1315.8142 1318.8599 1328.9837 1329.5552 1342.6395 1353.2117 1358.0084 1362.1000 1366.8291 1386.6950 1387.5362 1438.4788 1441.5261 1443.3760 1449.1146 1453.4643 1454.8982 1484.3849 1484.4762 1594.6818 1594.8310 1612.7403 1613.1808 2996.5674 3000.5308 3014.9816 3024.7633 3057.1924 3061.1190 3084.1959 3104.6336 3117.5272 3118.3225 3122.8327 3123.2019 3135.1785 3135.6431 3147.0517 3147.4474 3164.9438 3165.2333
redmass: 4.0495 6.4395 5.3000 5.4149 4.2368 4.7507 5.4419 5.3041 6.2887 6.0661 4.7805 3.6845 5.6917 4.2481 5.6162 4.6190 7.4681 3.7957 4.3459 2.2170 2.0234 2.8135 2.7992 3.8258 5.3551 3.8956 4.4315 5.2867 5.3527 6.2028 6.2099 2.7703 4.2254 1.7346 1.6942 1.5303 2.2213 2.0720 3.6647 3.5805 5.6481 1.2509 1.2444 4.5056 1.9592 1.7742 1.7710 1.7418 2.2231 1.3938 1.3944 5.8944 6.0604 1.3228 1.3224 5.2008 2.3605 2.2078 2.2049 1.6466 1.5641 1.8579 1.9425 1.0574 1.0587 1.1136 1.1165 3.0264 2.8270 2.9503 2.0015 1.7613 1.5909 1.4582 1.3225 1.7346 1.3997 1.5166 1.3502 2.4160 2.5752 1.3403 5.1538 4.5127 1.1527 1.7753 1.8752 1.2077 1.1445 1.1327 2.2023 2.2016 6.0316 6.0341 6.0056 5.9633 1.0591 1.0589 1.0583 1.0578 1.1025 1.1030 1.1031 1.1065 1.0873 1.0868 1.0877 1.0876 1.0912 1.0912 1.0958 1.0958 1.1013 1.1013
irintensity: 0.0065 0.0035 0.9702 0.9604 0.1860 0.5271 3.8199 3.6080 1.1172 1.6778 1.4828 2.4023 0.0768 0.5271 3.1652 9.8100 0.0104 1.5895 0.1515 1.4803 1.1332 0.1297 0.2106 0.3305 8.3134 16.1682 5.0013 0.7180 15.2758 2.3049 0.0005 4.9778 13.8139 63.7931 90.1411 48.3812 52.6009 8.7569 0.1145 10.2758 0.9107 0.4809 0.6595 85.8961 10.9211 51.5877 24.1340 26.0539 0.7147 0.0702 0.1350 1.2315 0.5062 0.5451 1.0483 4.7992 59.2231 4.6870 109.3744 17.2924 1.1120 5.6365 4.8619 0.3117 0.6284 0.2250 0.0164 5.7502 7.1012 10.5617 30.1098 27.6971 10.6778 23.6401 26.0557 140.6941 5.5251 34.5307 2.8186 91.3209 6.2089 3.1376 2.3134 1.4011 8.2624 13.5764 1.5938 11.7468 27.4206 33.3555 7.4233 12.6107 1.1862 1.0897 1.8249 2.4835 24.6018 23.0967 3.1696 15.6905 6.3991 6.4900 1.2822 1.8466 11.6104 2.0254 1.2419 1.4238 16.9216 2.0217 25.9021 33.1352 21.3549 19.1264
temp: 298.150 k
press: 1.00000 atm
elementType: 8 8 7 7 7 7 6 6 6 6 6 6 6 6 6 6 6 6 6 6 6 6 1 1 1 1 1 1 1 1 1 1 1 1 1 1 1 1 1 1
symmnumber: 1
zpe: 830430.3 jmol-1
zpe.correction: 0.316294 hartree
zpe.thermalcorrener: 0.336778 hartree
zpe.thermalcorrenthalpy: 0.337722 hartree
zpe.thermalcorrgfe: 0.262164 hartree
zpe.sumelectzpe: -988.223423 hartree
zpe.sumelectthermal: -988.202940 hartree
zpe.sumelectthermalent: -988.201996 hartree
zpe.sumelectthermalfe: -988.277553 hartree
dipole: -0.2584 -8.3476 0.0069
dipole: 8.3516
quadrupole: -129.3188 -152.7831 -122.3981
quadrupole: -0.3978 -13.6391 0.6420
quadrupole: 5.5145 -17.9498 12.4353 -0.3978 -13.6391 0.6420
hfenergy: -988.5397177 hartree
pointgroup: C01 [X(C16H18N4O2)]
dipole: 0.0926217 3.2628724 -0.3759965 debye
polarizability: 191.6117547|4.2755634|244.2999322|23.4762293|-10.9052471|162.1537147 unknown
InChI: InChI=1S/C16H18N4O2/c21-17-19(13-15-7-3-1-4-8-15)11-12-20(18-22)14-16-9-5-2-6-10-16/h1-10H,11-14H2
charge 0 multiplicity 1
40 atoms
O  -1.437607 -3.481732 1.951754
O  1.272882 -3.865737 -1.100164
N  -1.062941 -1.268352 1.761721
N  1.038306 -1.648117 -1.409241
N  -1.833453 -2.305087 2.281581
N  1.743904 -2.818066 -1.675429
C  0.142812 -1.506459 0.944022
C  -0.181917 -1.629876 -0.576741
C  -1.5371 0.085921 2.113218
C  1.586628 -0.437159 -2.052832
C  -2.198136 0.827604 0.95275
C  2.225933 0.546977 -1.075535
C  -1.69319 2.07203 0.504717
C  1.774418 1.88645 -0.997638
C  -3.347445 0.282115 0.323673
C  3.305185 0.133819 -0.251434
C  -2.32588 2.765196 -0.554311
C  2.391475 2.803384 -0.114148
C  -3.978575 0.970702 -0.73455
C  3.919938 1.045776 0.633391
C  -3.469594 2.215786 -1.176801
C  3.464938 2.384818 0.70428
H  0.842556 -0.672126 1.117127
H  0.596005 -2.45511 1.28412
H  -0.720424 -2.579994 -0.745594
H  -0.804831 -0.782322 -0.906607
H  -0.687566 0.674796 2.506036
H  -2.261248 -0.066453 2.934595
H  0.783803 0.064381 -2.625218
H  2.339236 -0.811127 -2.771567
H  -0.803515 2.499636 0.983979
H  0.939036 2.214041 -1.629112
H  -3.743797 -0.681708 0.666319
H  3.661225 -0.902305 -0.308357
H  -1.931049 3.731809 -0.887461
H  2.039187 3.840206 -0.068919
H  -4.867266 0.542376 -1.21116
H  4.755241 0.717525 1.261835
H  -3.962442 2.751922 -1.995398
H  3.94587 3.093457 1.387601
