program: Gaussian 09
title: 000153044
version: EM64L-G09RevD.01
frameworkgroup: C1[X(C22H23N4)]
method: RPBEPBE
basis: SDD
operation: Freq
keyword: #p
keyword: freq=noraman
keyword: PBEPBE/SDD
title: #p freq=noraman PBEPBE/SDD
converged: YES YES NO NO
title: Mulliken charges:
elementType: N N N N C C C C C C C C C C C C C C C C C C C C C C H H H H H H H H H H H H H H H H H H H H H H H
charge: -0.186888 -0.570101 -0.686054 -0.694123 0.048851 0.247718 0.256849 -0.429318 0.263883 0.328799 -0.342190 0.209864 -0.567729 -0.587496 -0.359733 -0.361390 -0.396350 0.546432 0.555181 -0.473243 -0.454528 -0.356065 -0.359157 -0.220766 -0.224929 -0.226514 0.240903 0.271505 0.259473 0.220139 0.255759 0.259549 0.234166 0.236335 0.204499 0.201119 0.246022 0.243944 0.259438 0.256923 0.251686 0.250433 0.273134 0.296855 0.335828 0.328271 0.328775 0.331704 0.252531
chargesum: 1.00000
title: Mulliken charges with hydrogens summed into heavy atoms:
elementType: N N N N C C C C C C C C C C C C C C C C C C C C C C
charge: -0.186888 -0.000111 -0.021955 -0.033643 0.048851 0.247718 0.256849 0.083090 0.263883 0.328799 0.137422 0.209864 -0.311970 -0.327948 -0.125567 -0.125054 0.009269 0.546432 0.555181 -0.227221 -0.210583 -0.096626 -0.102234 0.030920 0.025504 0.026018
polarizability: 4.33891727e+02 -3.44557310e+00 3.36580974e+02 1.25836513e+01 7.25938064e+00 1.60097864e+02
1716.lowfreq: -7.7073 -5.7742 -0.0008 -0.0007 -0.0004 8.0563 24.3633 31.2993 42.6430
frequency: 24.2073 31.2155 42.5621 51.9361 61.1663 62.0447 66.1941 95.4910 130.2792 144.4816 164.2486 179.8386 204.0835 216.8996 225.2919 243.2999 259.8405 266.9297 316.0195 322.0622 361.4267 365.0295 396.7491 403.1340 410.4210 418.5328 430.7540 440.7874 464.2130 474.6635 495.3366 503.2429 505.6425 512.3314 523.1641 562.0766 574.5657 580.6479 610.2150 612.2705 630.1264 660.1287 687.8517 696.0480 705.3103 710.4575 721.7916 735.1660 765.9160 774.2081 785.3960 829.2503 839.0453 844.3658 849.4835 855.0502 864.5578 873.8111 939.0471 943.0761 963.8939 966.5136 976.7361 977.5560 985.1617 986.7301 990.1203 1009.6034 1012.6958 1029.5703 1040.5332 1053.9307 1060.7931 1079.7283 1082.9157 1112.1778 1131.2576 1139.6316 1173.0470 1181.5442 1186.5529 1193.2907 1216.7989 1247.1783 1249.9557 1270.9147 1280.3656 1294.9231 1308.9470 1314.4993 1324.0896 1343.6202 1350.5429 1359.5547 1367.1574 1377.5468 1390.5952 1392.6056 1409.3332 1430.0863 1447.1238 1470.6968 1474.8225 1475.8652 1486.2226 1488.0582 1499.6061 1509.6580 1545.8108 1555.1199 1569.7040 1580.6507 1605.9674 1639.3146 1646.2831 1647.9657 1656.7223 1658.3791 2876.2927 3000.1516 3014.3508 3038.6552 3073.1998 3111.3594 3134.4139 3135.9015 3136.3433 3143.9483 3150.1591 3159.8053 3160.6533 3170.1716 3176.3075 3180.7109 3183.8326 3483.0996 3553.1402 3556.1714 3609.5767 3688.8753 3692.2765
redmass: 4.8513 4.0645 3.9312 2.9720 2.8342 4.8343 3.3472 3.6174 4.4369 2.8541 4.5758 2.1519 2.0288 3.1652 2.9623 4.4009 4.6278 4.5067 5.5927 3.1193 4.2099 3.4189 2.8219 2.8986 1.1321 1.0695 2.4964 3.4069 3.2442 3.2397 1.3362 1.5139 3.4912 2.4721 6.1449 4.5275 2.0924 1.8319 5.8676 4.2712 4.3463 5.7015 5.5821 5.1485 5.5577 2.1093 3.1320 2.4005 1.1700 2.4388 2.1602 1.5092 1.8105 2.0629 5.8247 1.3273 1.3489 1.5940 1.6642 2.4906 1.4025 2.4162 1.3814 2.0530 4.9719 4.6800 1.4871 3.3946 1.3251 2.3580 2.3656 2.0244 1.5765 2.0362 1.6349 3.0787 2.7824 1.6432 1.3714 1.0552 1.5737 1.1186 1.8652 1.3464 1.4833 1.3835 1.6112 1.1100 1.2678 1.4061 1.9849 2.1571 2.2688 1.9419 6.0795 2.7224 2.8778 1.5861 3.4889 2.1607 5.3055 3.9682 1.2972 2.9776 1.4464 1.8643 1.2680 2.3702 6.0389 4.7071 7.5097 5.7960 5.9882 3.2760 2.7198 1.1105 1.4377 1.4502 1.0713 1.0691 1.0815 1.0643 1.0991 1.0998 1.0882 1.0886 1.0896 1.0898 1.0915 1.0913 1.0962 1.0965 1.1016 1.0922 1.0914 1.0455 1.0460 1.0459 1.0986 1.1040 1.1040
irintensity: 0.0584 0.1307 0.0503 0.8276 1.1909 0.1060 6.1795 0.1526 0.7713 0.9712 4.9756 20.6685 28.1207 11.1586 11.1724 2.4665 1.4376 2.4320 1.1601 1.1030 1.9803 0.1166 0.6233 0.6888 17.1040 1.2192 24.6878 3.2096 7.9804 33.9849 245.2153 117.4472 7.2730 154.4378 5.3065 7.4681 107.1090 114.1525 0.9552 8.4566 3.0740 1.3074 10.3761 4.1450 0.8772 35.2101 5.4280 15.4254 15.5170 1.2375 29.9744 36.7639 0.6381 82.0445 3.6708 1.5343 4.1017 12.0792 0.5346 8.1345 0.1394 1.9133 0.6274 4.3398 11.5395 8.8145 1.2379 3.9924 0.2673 4.3310 6.3865 11.3928 4.9542 9.3978 8.5604 44.3124 4.1145 6.4450 18.0856 0.0024 11.0713 2.1870 27.2624 17.7622 11.9286 1.1157 113.5280 0.9914 6.4065 1.2301 78.8796 21.7501 12.7445 64.2007 0.3103 30.6554 25.6064 17.6205 12.7963 12.2920 48.6378 29.5314 5.0464 16.2403 30.2344 9.9767 61.7054 340.6674 18.8306 7.4753 25.7491 2.1945 1.1277 30.5245 103.9380 47.1164 734.1745 159.8138 86.7477 1.5054 29.2318 20.8886 16.4884 7.3396 2.4470 1.1841 8.4198 6.3035 2.8395 7.2540 11.8150 1.5280 12.9313 17.1223 6.9388 5.2761 291.3481 131.9349 5.2326 33.1948 31.3599
temp: 298.150 k
press: 1.00000 atm
elementType: 7 7 7 7 6 6 6 6 6 6 6 6 6 6 6 6 6 6 6 6 6 6 6 6 6 6 1 1 1 1 1 1 1 1 1 1 1 1 1 1 1 1 1 1 1 1 1 1 1
symmnumber: 1
zpe: 1065355.0 jmol-1
zpe.correction: 0.405772 hartree
zpe.thermalcorrener: 0.429135 hartree
zpe.thermalcorrenthalpy: 0.430079 hartree
zpe.thermalcorrgfe: 0.352491 hartree
zpe.sumelectzpe: -1069.147724 hartree
zpe.sumelectthermal: -1069.124361 hartree
zpe.sumelectthermalent: -1069.123417 hartree
zpe.sumelectthermalfe: -1069.201004 hartree
dipole: 0.4510 -0.9403 0.5898
dipole: 1.1981
quadrupole: -64.3489 -87.8706 -149.2275
quadrupole: 2.3733 8.6486 3.3863
quadrupole: 36.1335 12.6117 -48.7452 2.3733 8.6486 3.3863
hfenergy: -1069.5534958 hartree
pointgroup: C01 [X(C22H23N4)]
dipole: 0.3792337 -0.158743 0.2306114 debye
polarizability: 396.4093413|47.7365009|374.7773062|-1.000626|5.6907178|159.383917 unknown
InChI: InChI=1S/C22H23N4/c23-11-4-12-26-21-14-17(25)8-10-19(21)18-9-7-16(24)13-20(18)22(26)15-5-2-1-3-6-15/h1-3,5-10,13-14H,4,11-12,23-25H2
charge 1 multiplicity 1
49 atoms
N  0.238463 0.796594 0.321266
N  -0.633177 5.27978 -1.731245
N  4.842235 2.506357 0.32901
N  -1.673656 -5.009624 -0.436501
C  -0.667875 -0.229516 0.215758
C  1.644169 0.585094 0.216858
C  -0.230859 -1.58036 0.000033
C  -0.257086 2.199498 0.533734
C  2.122031 -0.759453 0.012126
C  1.186797 -1.852459 -0.1011
C  -0.274218 3.034043 -0.766106
C  -2.13165 0.073086 0.334297
C  2.549504 1.671782 0.32062
C  -1.187262 -2.635609 -0.113024
C  3.540754 -0.940427 -0.071811
C  1.580656 -3.211445 -0.313285
C  -0.675843 4.502595 -0.485432
C  3.945681 1.459154 0.232521
C  -0.772121 -3.966178 -0.322441
C  4.430019 0.119653 0.034603
C  0.642076 -4.232203 -0.420138
C  -2.781201 -0.045085 1.591472
C  -2.888161 0.416055 -0.816353
C  -4.167425 0.20531 1.698328
C  -4.275396 0.660176 -0.704741
C  -4.916227 0.560879 0.552064
H  0.380215 2.668553 1.30288
H  -1.272159 2.134212 0.951036
H  0.709585 3.034484 -1.266155
H  -0.997064 2.586536 -1.475372
H  2.193423 2.693887 0.457447
H  -2.25287 -2.401762 -0.036491
H  3.946322 -1.943667 -0.222917
H  2.638685 -3.471491 -0.397626
H  0.052663 4.951014 0.218476
H  -1.666355 4.516516 0.032217
H  5.508642 -0.059468 -0.033994
H  0.979482 -5.262491 -0.583946
H  -2.205808 -0.331822 2.479044
H  -2.399161 0.47356 -1.79547
H  -4.660754 0.117939 2.671783
H  -4.853677 0.921094 -1.597101
H  -1.35543 5.04189 -2.416208
H  -0.521968 6.28947 -1.615555
H  5.843952 2.344219 0.259145
H  4.529025 3.465244 0.459619
H  -2.675915 -4.849779 -0.37262
H  -1.356629 -5.963532 -0.58967
H  -5.991029 0.751597 0.636664
