program: Gaussian 09
title: 000153034
version: EM64L-G09RevD.01
frameworkgroup: C1[X(C10H11NO4)]
method: RPBEPBE
basis: SDD
operation: Freq
keyword: #p
keyword: freq=noraman
keyword: PBEPBE/SDD
title: #p freq=noraman PBEPBE/SDD
converged: YES YES NO NO
title: Mulliken charges:
elementType: O O O O N C C C C C C C C C C H H H H H H H H H H H
charge: -0.296768 -0.222937 -0.222763 -0.187451 0.015570 -0.046364 -0.345793 -0.320047 0.284020 0.220280 -0.539636 0.485266 -0.339735 -0.355963 -0.802137 0.256029 0.223510 0.234926 0.231827 0.225539 0.263550 0.285350 0.244661 0.228829 0.239876 0.240361
chargesum: 0.00000
title: Mulliken charges with hydrogens summed into heavy atoms:
elementType: O O O O N C C C C C C C C C C
charge: -0.296768 -0.222937 -0.222763 -0.187451 0.015570 0.209665 0.112643 0.137319 0.284020 0.220280 -0.276086 0.485266 -0.054385 -0.111302 -0.093071
polarizability: 1.72442009e+02 -8.20516025e+00 1.61023393e+02 -4.68670168e+00 9.73325122e-02 7.35871163e+01
1716.lowfreq: -0.0008 -0.0007 -0.0006 4.4455 7.6941 8.8675 28.4354 35.9105 40.8777
frequency: 28.4036 35.7316 40.8235 53.2940 82.0619 95.3439 116.3148 191.0525 213.3377 222.3096 272.4140 294.7371 342.1578 363.3052 413.1176 427.9920 454.0156 553.4538 565.9981 587.1289 611.6206 667.5412 711.3470 734.5186 750.7194 774.3740 802.1585 828.7534 856.3876 900.4670 908.5358 965.2876 975.7237 980.7218 1016.8935 1026.2008 1044.6453 1065.2844 1094.0998 1113.5140 1138.9999 1157.0517 1178.2333 1205.1830 1216.4627 1239.9715 1261.6998 1279.9328 1350.3882 1354.5175 1387.0465 1398.4496 1412.1294 1419.0590 1467.4265 1469.0122 1476.0703 1481.9074 1488.4717 1583.3052 1613.8469 2975.4533 2983.1272 3044.4574 3062.3301 3076.9515 3092.9648 3124.4429 3146.2388 3159.3305 3181.3459 3188.4146
redmass: 12.4560 1.0658 4.8582 3.5149 5.1966 4.2065 3.3841 6.0623 4.5287 4.1278 5.7023 5.0083 6.6567 4.1911 2.2082 4.8341 3.7070 5.0872 6.5353 4.4707 6.4631 4.6811 6.6037 4.2520 7.8840 9.4697 4.2761 1.3403 1.4752 1.2311 4.7426 2.1319 1.4360 1.8528 1.7559 1.4554 1.5684 5.7106 1.3797 1.3371 1.4974 1.4939 1.8915 8.0851 1.3814 1.4527 2.4491 1.8733 1.4157 6.4875 5.3555 1.3226 2.3281 2.3150 1.0464 1.2741 1.3586 1.3165 1.5913 7.3174 6.1797 1.0557 1.0375 1.1075 1.0972 1.0536 1.0992 1.0923 1.0902 1.0906 1.0950 1.1192
irintensity: 0.4327 0.6391 3.7537 0.9056 4.3856 0.2880 5.3107 0.8613 0.1642 8.2248 3.2514 1.2126 2.5391 6.9756 1.4969 8.3625 5.1207 2.1942 1.4197 4.1443 3.4327 11.5335 2.1164 6.9734 20.2798 10.1028 34.1974 48.2986 5.5744 8.6069 8.1972 21.1678 14.2822 49.6381 33.9509 2.9070 13.9858 35.9331 5.3589 12.1595 1.9942 19.9746 93.9026 322.5211 20.6939 1.3911 47.6976 86.0371 4.6425 76.2912 27.6101 15.0865 77.2975 17.2951 14.5259 19.7581 17.6417 30.1825 41.1771 68.6256 141.5236 26.9666 17.9067 21.7116 13.8094 19.6021 17.6881 11.6218 9.9955 7.2163 2.9905 24.3605
temp: 298.150 k
press: 1.00000 atm
elementType: 8 8 8 8 7 6 6 6 6 6 6 6 6 6 6 1 1 1 1 1 1 1 1 1 1 1
symmnumber: 1
zpe: 513174.1 jmol-1
zpe.correction: 0.195458 hartree
zpe.thermalcorrener: 0.210048 hartree
zpe.thermalcorrenthalpy: 0.210992 hartree
zpe.thermalcorrgfe: 0.151105 hartree
zpe.sumelectzpe: -742.046295 hartree
zpe.sumelectthermal: -742.031704 hartree
zpe.sumelectthermalent: -742.030760 hartree
zpe.sumelectthermalfe: -742.090647 hartree
dipole: 1.5772 -5.4210 0.5505
dipole: 5.6725
quadrupole: -84.8512 -97.4370 -85.6875
quadrupole: -14.8850 -1.0111 -0.0194
quadrupole: 4.4741 -8.1117 3.6377 -14.8850 -1.0111 -0.0194
hfenergy: -742.2417523 hartree
pointgroup: C01 [X(C10H11N1O4)]
dipole: -0.8548046 -2.0400641 -0.2969158 debye
dipolederiv: -0.5663657 0.1182189 -0.0705278 0.1567551 -0.5362138 0.050208 -0.106445 0.0607107 -0.3035932 -1.8583709 0.4347605 -0.0751223 0.1930766 -0.2536882 -0.0032651 -0.1617517 0.0528985 -0.2444797 -0.5476496 0.2156121 0.1264777 0.2065051 -0.9001809 -0.1317595 0.1269429 -0.1121778 -0.2951839 -0.6919569 -0.2291779 0.1451934 -0.1701665 -0.5713753 0.0030621 0.1309119 -0.0321264 -0.2539333 1.0267787 0.2462672 -0.3129134 0.0535342 1.8274873 0.1746597 -0.2759411 0.1816649 0.3000618 0.3335846 0.0227267 0.0335035 0.0039852 0.2098303 0.1063123 0.1491735 0.0085965 0.2206563 0.1722952 0.0184487 0.1270954 0.0760072 0.2448217 -0.0709375 0.0171996 0.0192319 0.2078356 0.8776056 -0.2422212 -0.0517116 -0.5846979 0.4153602 -0.0780407 0.0572155 -0.0695621 0.3213477 1.5063144 -0.3769791 0.0957764 0.3831388 0.2715626 0.0228863 0.1519625 0.0401204 0.1552515 -0.3274951 -0.3449898 0.0227834 -0.0001136 -0.772325 -0.0331144 -0.0044759 -0.0381043 -0.0238041 -0.529602 -0.1127798 -0.0241698 -0.4719893 -0.133413 -0.0254835 -0.0391185 -0.0076588 -0.2100967 0.3898438 -0.0285313 0.0225182 0.1909772 0.6071791 0.0352757 0.0385537 0.0155501 0.0120054 0.1229672 0.434303 0.0330908 0.0407327 0.2258819 0.0161263 -0.0091311 -0.0381509 -0.0776924 0.0361539 0.0685511 0.0167428 -0.0436694 -0.6476813 -0.0214722 0.0062905 -0.0195569 -0.2003081 -0.0533042 -0.2291739 -0.015529 -0.1168199 -0.1341347 -0.014911 -0.0134223 -0.0235931 0.0454373 0.0062086 -0.0075248 0.0044711 -0.0404228 0.0458439 -0.0828496 0.0061037 -0.0938779 -0.0361114 0.0887561 -0.0351271 -0.0970773 -0.0559563 0.0515759 -0.0135885 -0.0667172 0.0155983 -0.0912582 -0.0235438 -0.104403 -0.0097158 -0.1202716 -0.0060799 0.0443712 0.0016203 0.0120727 0.0594649 -0.0524649 -0.0337515 0.0848975 0.0915254 -0.0370037 0.0809373 0.0275941 0.1010019 -0.0479005 0.0025161 0.0058932 -0.026194 0.0976224 -0.0315986 -0.0536235 -0.0208202 -0.0969044 -0.0703913 0.0430769 0.083034 -0.0066415 0.0970676 -0.0225149 -0.0018562 -0.0117569 -0.0011676 0.1549464 0.0949243 0.0222581 -0.0089903 0.0599106 0.060565 0.0040389 0.0133113 0.0100022 0.1630153 -0.0931741 -0.0332725 -0.0167088 -0.0340443 0.0754746 -0.0044096 -0.018105 0.0065079 0.15718 -0.0226392 0.1596737 -0.0068251 0.0490577 -0.0388989 -0.000001 -0.0077056 0.0099127 0.1081882 0.0147059 -0.032959 0.1085738 -0.0329738 0.0229755 -0.0075893 0.1197316 0.0484766 -0.0059298 0.0508351 -0.0188564 -0.0989975 -0.0287701 0.0265504 0.0050236 -0.1112203 -0.0494649 -0.0447078 unknown
polarizability: 174.1582184|6.8838686|159.1831253|-4.0483824|3.6876887|73.7111747 unknown
InChI: InChI=1S/C10H11NO4/c1-7-2-3-9(11(12)13)10(4-7)15-6-8-5-14-8/h2-4,8H,5-6H2,1H3
charge 0 multiplicity 1
26 atoms
O  4.355876 -1.570413 0.16357
O  1.005789 0.102942 0.187095
O  -1.556009 3.356665 0.47122
O  0.505015 2.684408 -0.230733
N  -0.715331 2.437622 0.103294
C  3.282801 -0.552751 0.469407
C  4.17706 -0.343434 -0.708892
C  1.879611 -1.087004 0.289935
C  -0.362232 -0.092667 0.063541
C  -1.220179 1.051127 0.044872
C  -0.959739 -1.379888 -0.012906
C  -2.358912 -1.548124 -0.111191
C  -2.622911 0.885092 -0.034203
C  -3.189391 -0.3948 -0.117999
C  -2.967332 -2.934299 -0.204422
H  3.457243 0.03678 1.377143
H  3.793461 -0.54754 -1.715929
H  4.986897 0.391164 -0.641048
H  1.578333 -1.704074 1.159952
H  1.815651 -1.696738 -0.632353
H  -0.325935 -2.271217 0.002079
H  -3.241725 1.786356 -0.027396
H  -4.276363 -0.506484 -0.190191
H  -2.200051 -3.725344 -0.16544
H  -3.680058 -3.110503 0.622495
H  -3.531772 -3.055377 -1.1478
