program: Gaussian 09
title: 000152961
version: EM64L-G09RevD.01
frameworkgroup: C1[X(C10H8ClNO)]
method: RPBEPBE
basis: SDD
operation: Freq
keyword: #p
keyword: freq=noraman
keyword: PBEPBE/SDD
title: #p freq=noraman PBEPBE/SDD
converged: NO YES NO NO
title: Mulliken charges:
elementType: Cl O N C C C C C C C C C C H H H H H H H H
charge: -0.023708 -0.208984 -0.407069 0.161669 0.231316 0.184386 -0.347124 -0.377091 -0.349072 0.182278 -0.240318 -0.207982 -0.699816 0.316413 0.266138 0.289514 0.232878 0.228137 0.226920 0.270354 0.271161
chargesum: 0.00000
title: Mulliken charges with hydrogens summed into heavy atoms:
elementType: Cl O N C C C C C C C C C C
charge: -0.023708 -0.208984 -0.090656 0.161669 0.231316 0.184386 -0.080986 -0.087577 -0.116194 0.182278 -0.012180 0.018938 -0.158302
polarizability: 1.88327263e+02 -9.35974384e-01 1.37196140e+02 -3.53015560e-03 2.03016309e-02 5.24734351e+01
1716.lowfreq: -25.2373 -0.0032 -0.0029 -0.0020 4.0457 5.4757 14.7926 49.9516 95.6411
frequency: -25.1619 49.8833 95.6354 119.8471 219.6924 226.6460 233.2707 278.3395 389.9747 424.8195 491.1435 522.0727 556.4023 570.5399 588.7159 613.6830 647.4125 710.8144 741.7387 759.6934 770.3070 770.6459 812.0053 866.7918 868.4588 919.6390 933.3401 951.1877 993.2938 1009.7862 1088.8280 1127.3703 1141.0538 1145.5239 1167.6474 1239.5130 1247.9208 1260.8143 1298.7859 1353.4236 1392.4011 1419.7172 1422.5011 1449.5157 1485.4476 1525.0266 1585.0326 1596.3166 1632.4531 3028.3745 3103.5838 3129.6532 3142.0746 3161.0055 3183.6704 3223.0604 3595.6638
redmass: 3.1014 6.0547 7.6627 5.3820 4.0395 8.9767 10.9585 4.9897 6.8383 2.9260 5.0696 2.9458 7.4103 3.2468 1.2544 6.7651 2.6209 7.8368 6.5200 1.3083 4.5097 5.2679 1.4129 5.0111 1.4109 2.0561 5.1306 1.3740 1.3105 2.0983 2.4386 1.8063 1.0902 1.4135 1.1290 1.6588 1.8176 1.7353 2.3874 2.6143 5.0629 1.1119 2.4831 3.5033 3.0339 4.8031 7.1727 8.3751 7.1390 1.0562 1.1075 1.0861 1.0913 1.0974 1.0969 1.0979 1.0811
irintensity: 3.9758 3.7009 0.8322 0.0104 9.3229 2.0856 0.0057 0.9208 0.9859 12.1914 3.6864 1.9956 2.3268 11.8424 84.9978 17.9526 7.4097 55.8973 7.0780 117.7179 8.2560 22.1288 14.7578 3.0802 0.6632 4.4726 44.2198 4.9936 0.7578 12.4244 11.7529 98.7187 1.1976 2.7747 5.8792 18.7563 10.9706 27.4186 13.4926 4.5382 73.9395 12.6795 65.0344 21.6074 0.6858 96.2052 75.6101 76.4752 1.4086 16.7530 5.7507 0.4035 18.3429 24.4613 6.6611 0.0132 75.5314
temp: 298.150 k
press: 1.00000 atm
elementType: 17 8 7 6 6 6 6 6 6 6 6 6 6 1 1 1 1 1 1 1 1
symmnumber: 1
zpe: 408418.0 jmol-1
zpe.correction: 0.155558 hartree
zpe.thermalcorrener: 0.165637 hartree
zpe.thermalcorrenthalpy: 0.166582 hartree
zpe.thermalcorrgfe: 0.118811 hartree
zpe.sumelectzpe: -974.995282 hartree
zpe.sumelectthermal: -974.985203 hartree
zpe.sumelectthermalent: -974.984258 hartree
zpe.sumelectthermalfe: -975.032029 hartree
dipole: 4.2042 6.1427 0.0171
dipole: 7.4437
quadrupole: -83.8525 -68.9222 -85.5787
quadrupole: -3.9307 -0.0705 -0.0002
quadrupole: -4.4014 10.5289 -6.1275 -3.9307 -0.0705 -0.0002
hfenergy: -975.1508401 hartree
pointgroup: C01 [X(C10H8Cl1N1O1)]
dipole: -1.5707527 2.471673 -0.0068268 debye
dipolederiv: -0.5332044 0.086079 -0.0015574 0.172612 -0.1448044 0.0007928 -0.003809 0.0007009 -0.1458335 -0.64208 0.0278421 0.0008057 0.409043 -0.8519069 0.000029 0.0021463 -0.0002466 -0.3022045 -0.7962842 0.4334061 0.0006856 0.0071955 -0.4455128 -0.0000463 0.0004827 -0.0001513 -0.2588916 0.2640877 0.1304073 0.00007 0.1894542 -0.1524207 -0.0001317 0.0008629 -0.0002149 0.0248143 0.0570134 0.0991097 0.0000297 0.472789 0.2052712 -0.0002357 0.000706 0.0000984 0.024651 -0.8221252 0.2705416 0.0006783 0.5182568 -0.3790907 -0.0009221 0.0005094 -0.0007397 -0.094968 0.4418326 -0.582689 -0.0008298 -0.7175352 0.3154446 0.0004593 -0.0011031 0.0004789 -0.1133779 -0.0526337 -0.0254861 -0.0000345 -0.0566436 0.0675122 0.0002789 0.0000247 0.0001181 -0.1342286 0.0482372 -0.0434048 -0.0001677 -0.0645788 0.0105552 0.0002426 -0.0003603 0.0002196 -0.1845303 1.61651 -0.2390078 -0.0036434 -0.3017657 0.9065759 0.0003436 -0.0084204 0.0005328 0.130708 -0.087566 0.0016556 -0.0000772 0.0362947 0.1377605 0.0002441 -0.0001451 0.0001932 -0.1725881 0.0704244 -0.0038365 -0.0001756 -0.0626309 -0.0519961 0.0001065 -0.0002347 0.0001117 -0.1662324 0.3101041 -0.3049257 0.0045297 -0.5938733 0.0820923 0.0003974 0.0107884 -0.0000015 0.1923703 0.153321 0.0046225 0.000139 -0.0424489 0.23967 -0.0000912 0.0000211 -0.0001628 0.339033 0.0488397 -0.0643712 -0.0000352 -0.086363 0.0498701 -0.000027 -0.0003589 -0.0000612 0.1881269 0.0846145 0.0806223 0.0001119 0.0323825 0.0534815 -0.0001324 0.000063 -0.0000841 0.1637631 0.0073136 0.0712322 0.0001746 0.1139935 -0.0430411 -0.0002731 0.0001986 -0.0002569 0.1783476 0.0459653 -0.0729568 -0.0000025 -0.0859144 -0.0942011 -0.0001731 0.0000044 -0.0001678 0.1619883 -0.1326215 -0.0359236 0.0001638 -0.041637 0.0854765 -0.0000418 0.0001987 -0.0000372 0.1624132 -0.0399032 0.0845573 0.0345539 0.0508078 0.0024262 -0.0836022 0.0158181 -0.0825681 0.0049944 -0.0418454 0.082526 -0.0354187 0.0505619 0.0068375 0.0827821 -0.0173925 0.0822385 0.0016448 unknown
polarizability: 188.3316496|-0.8071708|137.1917526|0.0246385|-0.0118749|52.4734362 unknown
InChI: InChI=1S/C10H8ClNO/c11-5-10(13)8-6-12-9-4-2-1-3-7(8)9/h1-4,6,12H,5H2
charge 0 multiplicity 1
21 atoms
Cl 4.797338 -0.490534 0.007545
O  1.997499 -1.611198 -0.001072
N  -0.832413 2.096985 0.002299
C  -0.64641 -0.18426 0.000154
C  -1.582672 0.903892 0.001714
C  0.693586 0.400044 -0.00013
C  0.522159 1.798557 0.001249
C  -1.133369 -1.516215 -0.000711
C  -2.979869 0.710329 0.002503
C  1.959989 -0.347789 -0.002051
C  -2.528083 -1.718802 0.000018
C  -3.440092 -0.622521 0.0016
C  3.237972 0.517704 -0.007457
H  -1.226026 3.036688 0.003536
H  1.266532 2.593222 0.001414
H  -0.427976 -2.35084 -0.001747
H  -3.682272 1.551126 0.003749
H  -2.92504 -2.739908 -0.000577
H  -4.51783 -0.819249 0.002153
H  3.270799 1.1628 0.886378
H  3.275378 1.142769 -0.915368
