program: Gaussian 09
title: 000152953
version: EM64L-G09RevD.01
frameworkgroup: C1[X(C8H10N2O2)]
method: RPBEPBE
basis: SDD
operation: Freq
keyword: #p
keyword: freq=noraman
keyword: PBEPBE/SDD
title: #p freq=noraman PBEPBE/SDD
converged: YES YES NO NO
title: Mulliken charges:
elementType: O O N N C C C C C C C C H H H H H H H H H H
charge: -0.425667 -0.234019 -0.617744 0.000267 -0.570443 -0.145307 0.451714 -0.315381 0.222752 -0.500259 -0.196098 -0.332117 0.200223 0.255875 0.247986 0.282513 0.301195 0.280279 0.241629 0.230368 0.241038 0.381197
chargesum: 0.00000
title: Mulliken charges with hydrogens summed into heavy atoms:
elementType: O O N N C C C C C C C C
charge: -0.044470 -0.234019 -0.036270 0.000267 -0.114344 0.102679 0.451714 -0.032868 0.222752 -0.258630 0.034270 -0.091079
polarizability: 1.23479627e+02 9.97537485e+00 1.04450645e+02 -7.67427663e+00 6.06342484e+00 7.03212722e+01
1716.lowfreq: -9.0669 -4.9576 -3.1552 0.0001 0.0004 0.0005 25.2151 42.3425 81.3802
frequency: 24.8074 42.2580 81.3651 93.5191 188.6661 240.4196 257.1765 271.1303 334.4863 339.9662 395.7973 431.8625 522.2541 550.6420 573.8657 597.3596 624.5850 640.9315 709.9276 724.3075 780.3423 801.7752 837.2629 922.5726 934.4917 945.8594 988.4291 996.3750 1008.2317 1029.5279 1046.3976 1095.3596 1117.1048 1165.8639 1194.4379 1210.0168 1232.9803 1258.2334 1286.5629 1312.3011 1334.3476 1341.3132 1385.9056 1416.6925 1456.7835 1459.5867 1557.1609 1587.1019 1629.2632 1673.8309 2882.0081 2993.3473 3072.3312 3102.9617 3129.6249 3150.2737 3169.2488 3466.5105 3514.0165 3599.6768
redmass: 4.9391 7.0698 4.2294 5.4122 5.3347 1.6132 2.2093 3.5053 2.2324 3.3633 3.0313 4.2857 3.6575 3.4832 1.3003 4.7824 3.2576 1.7782 4.1299 1.9712 3.0171 2.3445 2.6519 1.3957 1.9424 1.4910 1.8193 1.9874 3.7145 3.0288 2.3657 2.5960 1.7651 1.1513 1.4700 1.4480 1.7569 1.6815 1.2910 7.5046 1.4578 1.2355 1.8622 2.0375 1.2253 1.8197 5.4509 5.8702 1.0976 9.0435 1.0807 1.0643 1.0981 1.0910 1.0883 1.0923 1.0998 1.0446 1.0640 1.0988
irintensity: 4.2395 0.7993 4.1613 2.4664 1.4345 32.9496 21.6503 1.3155 0.5775 18.8508 0.6247 11.5850 40.1242 19.9187 43.4124 15.9156 114.8724 194.8179 18.7316 43.6183 3.2945 18.7413 13.4419 0.2174 2.0805 0.4229 6.7056 33.9774 9.4563 6.3221 295.0320 10.8344 15.1007 1.7487 1.4388 0.5081 1.7134 19.0312 6.1473 2.1697 10.5336 3.1899 11.5811 25.5147 17.9318 21.4652 7.2196 0.3667 43.9305 193.6028 61.1937 29.2867 8.0271 29.1874 8.1384 18.4383 14.3554 3.0514 25.0760 4.8018
temp: 298.150 k
press: 1.00000 atm
elementType: 8 8 7 7 6 6 6 6 6 6 6 6 1 1 1 1 1 1 1 1 1 1
symmnumber: 1
zpe: 452974.6 jmol-1
zpe.correction: 0.172529 hartree
zpe.thermalcorrener: 0.183966 hartree
zpe.thermalcorrenthalpy: 0.184910 hartree
zpe.thermalcorrgfe: 0.133621 hartree
zpe.sumelectzpe: -569.900204 hartree
zpe.sumelectthermal: -569.888767 hartree
zpe.sumelectthermalent: -569.887823 hartree
zpe.sumelectthermalfe: -569.939112 hartree
dipole: 2.5216 -0.1801 0.4908
dipole: 2.5752
quadrupole: -70.6159 -63.1256 -74.4500
quadrupole: 7.7678 7.6098 -3.6730
quadrupole: -1.2187 6.2716 -5.0528 7.7678 7.6098 -3.6730
hfenergy: -570.072733 hartree
pointgroup: C01 [X(C8H10N2O2)]
dipole: 0.9588664 0.1427655 -0.2944697 debye
dipolederiv: -0.7924787 -0.1033384 0.3921819 -0.2321109 -0.3601339 0.2989268 0.4780642 0.2255787 -0.8441617 -0.5464503 -0.1253088 0.1504653 0.0641988 -0.6565714 -0.3007063 0.3418279 -0.0746691 -0.6951257 -0.7594898 0.101861 -0.1695588 0.0946686 -0.3952083 -0.0625486 -0.1002472 -0.0360371 -0.5628398 -0.3889745 0.0165747 -0.0186744 0.0258965 -0.3145989 -0.0316529 -0.0384041 -0.0280519 -0.2609466 -0.0475373 0.0602977 0.020579 -0.047789 0.1293073 0.0040309 0.1204056 -0.015703 0.0568973 0.5262572 -0.1136539 0.1444348 -0.1943129 0.1392494 -0.0187625 -0.0770206 0.0296441 0.2939165 0.2824997 -0.1065576 -0.0090725 -0.0832922 -0.1516672 -0.0566777 0.0609851 -0.0778417 -0.0697685 0.0032949 0.0220238 0.0687932 0.067918 0.0441589 0.0718769 0.0676697 0.0618689 -0.0680594 0.7843885 0.2138684 -0.582994 0.2835006 0.9219121 0.0840796 -0.8002312 -0.0209271 1.1158529 0.0291423 0.0257564 0.0693075 -0.1134949 0.2433791 0.1118842 -0.0121441 0.172244 -0.0165534 -0.1990013 -0.0240746 -0.0328397 -0.1333529 0.0507923 0.0535344 -0.0945652 0.0672636 -0.0926502 0.3021184 -0.136326 0.078119 0.0002951 0.0713337 0.0750831 0.1375431 0.0309907 -0.0251042 0.0186615 -0.01223 -0.0043152 0.0422621 -0.1581261 0.0316128 0.0050912 -0.0279677 0.0845185 0.0159226 0.0099732 -0.047392 0.005233 0.0808379 -0.0813121 -0.0521501 -0.0183218 -0.0401637 -0.0907329 0.0485179 -0.1057803 0.0109134 -0.0006295 0.0078637 -0.1476503 0.0443426 -0.1267697 0.1009586 -0.0446172 -0.0800471 -0.0462901 0.0674581 -0.0393109 -0.0778815 -0.0445196 0.1053494 0.1845125 0.0216527 0.0829772 0.0782112 0.2108114 0.0628624 0.1840402 0.0469277 0.1668844 0.1999404 -0.0780518 0.0396594 -0.0366262 0.0155235 0.0104483 0.0357764 -0.0738389 0.3270455 0.0530432 0.09344 0.0119094 0.1023809 -0.0708067 -0.0582571 0.013851 -0.0583642 0.0952588 0.0626679 0.0657107 0.0051055 0.0932667 -0.0586511 -0.0819248 0.012289 -0.084523 0.1168907 -0.1059029 0.0874497 -0.0370193 0.0667742 0.070155 -0.011779 -0.0526803 -0.0032587 0.1212882 0.3671601 -0.022968 0.0241611 -0.0482499 0.1214745 -0.0692711 -0.004569 -0.1148366 0.3182406 unknown
polarizability: 125.1045897|-8.5558664|101.2872665|-0.3040442|11.6597235|71.8596882 unknown
InChI: InChI=1S/C8H10N2O2/c9-7(8(11)12)4-6-2-1-3-10-5-6/h1-3,5,7,11H,4,9H2
charge 0 multiplicity 1
22 atoms
O  2.920168 1.179593 -1.366878
O  1.782319 1.67047 0.593684
N  2.900235 -1.42449 -0.280882
N  -2.966655 -0.960488 -0.503833
C  0.666229 -1.016441 0.726149
C  1.661338 -0.625628 -0.399495
C  -0.752303 -0.523894 0.487528
C  -1.209937 0.735488 0.95345
C  2.082188 0.845203 -0.292312
C  -1.680307 -1.325773 -0.228927
C  -2.539063 1.131046 0.685205
C  -3.378052 0.259831 -0.046758
H  0.658333 -2.122945 0.781034
H  1.063555 -0.642198 1.685422
H  1.146143 -0.741608 -1.384138
H  -0.525989 1.389371 1.503496
H  3.616301 -1.186128 -0.973516
H  2.73502 -2.431875 -0.201132
H  -1.383181 -2.317454 -0.596574
H  -2.920514 2.095814 1.034821
H  -4.414248 0.532695 -0.277473
H  3.220422 2.124411 -1.274871
