program: Gaussian 09
title: 000152890
version: EM64L-G09RevD.01
frameworkgroup: C1[X(C18H14N2O4S)]
method: RPBEPBE
basis: SDD
operation: Freq
keyword: #p
keyword: freq=noraman
keyword: PBEPBE/SDD
title: #p freq=noraman PBEPBE/SDD
converged: YES YES NO NO
title: Mulliken charges:
elementType: S O O O O N N C C C C C C C C C C C C C C C C C C H H H H H H H H H H H H H H
charge: 0.173070 -0.279258 -0.309930 -0.276755 -0.233537 -0.452968 -0.480875 0.423703 0.477758 -0.809597 -0.843467 0.528468 0.529792 0.187115 0.222317 -0.548711 -0.369394 -0.387268 -0.294754 -0.325328 0.081002 0.067570 -0.467985 -0.392804 -0.171611 0.285415 0.299522 0.275810 0.285894 0.252052 0.268908 0.264243 0.292048 0.279708 0.333805 0.354268 0.234208 0.298873 0.228695
chargesum: 0.00000
title: Mulliken charges with hydrogens summed into heavy atoms:
elementType: S O O O O N N C C C C C C C C C C C C C C C C C C
charge: 0.173070 -0.279258 -0.309930 -0.276755 -0.233537 -0.119163 -0.126607 0.423703 0.477758 -0.224660 -0.281764 0.528468 0.529792 0.187115 0.222317 -0.296659 -0.100487 -0.123025 -0.002706 -0.045620 0.081002 0.067570 -0.233777 -0.093931 0.057083
polarizability: 3.68195975e+02 3.66470632e+00 3.01240428e+02 -1.16600960e+00 1.20024064e+01 1.14888523e+02
1716.lowfreq: -3.6540 -1.4533 -0.0009 -0.0006 0.0018 4.1912 26.4294 36.0078 47.4506
frequency: 26.4248 35.9975 47.4464 71.7675 79.9460 87.4195 91.5962 119.9970 132.9867 145.1996 170.5422 173.7242 215.0230 242.1764 262.1930 266.0256 291.8081 297.4540 305.9867 326.7759 343.7273 370.7082 375.1007 447.5384 461.8296 481.7510 560.0064 577.9598 582.4492 589.4354 597.2886 609.9068 627.5110 649.2968 671.5508 673.8132 684.3672 689.1549 691.9250 707.8537 713.6910 738.9492 744.4890 786.2112 796.9789 815.1132 832.0948 847.3965 863.0158 869.4383 878.2759 891.7690 897.7794 910.6899 913.1506 920.8208 939.7915 948.5895 979.4634 980.5163 987.2155 1015.9365 1018.8055 1079.9873 1092.6838 1101.5897 1109.3475 1142.3407 1178.5911 1181.2719 1202.6318 1208.4035 1210.0922 1228.2850 1234.4059 1250.1960 1257.4044 1285.2153 1328.8862 1331.9835 1342.7037 1366.7853 1394.7633 1401.4523 1428.1196 1450.3136 1452.6083 1494.2837 1512.2464 1528.2610 1546.0660 1568.9560 1572.2123 1581.7838 1606.6140 1634.3468 1636.9265 3007.1665 3037.9079 3096.6725 3120.3004 3129.1562 3153.5082 3192.3218 3195.4154 3224.8473 3227.6992 3245.1797 3252.1040 3485.2322 3488.7265
redmass: 5.3078 6.1520 4.8091 7.0544 7.5346 7.9766 7.2775 7.9057 4.4612 6.7780 4.9145 8.7740 5.2764 3.5216 4.6022 5.6264 5.9465 4.9069 5.2321 4.6602 4.2514 6.3346 7.5466 3.9536 4.4401 6.7867 3.6555 5.8029 4.6607 4.0132 5.4455 6.7234 5.2736 6.7128 4.7561 2.0931 5.0859 3.2342 2.1590 3.8425 2.9566 2.4504 2.5243 3.8131 1.6427 1.2788 1.3162 5.0551 1.8093 1.8966 1.6988 1.4747 1.4117 5.6210 1.4073 6.0143 4.8968 6.1770 1.9893 1.9349 5.8947 1.3343 1.3239 1.9893 1.4947 2.9529 2.5429 1.3353 2.3286 1.1030 1.6675 1.8456 2.6668 1.5284 1.7197 2.1954 1.8249 1.9408 1.6552 2.9077 3.1291 4.7551 2.7679 5.5877 1.0932 1.3098 2.1030 3.1047 8.6429 8.6050 2.5873 2.6740 6.5123 6.3688 7.1388 2.8597 5.2696 1.0650 1.0581 1.0977 1.1071 1.0880 1.0949 1.0947 1.0924 1.0952 1.0957 1.1031 1.1028 1.0741 1.0760
irintensity: 0.0390 1.1608 1.4534 7.4486 1.5821 5.9842 1.1891 0.1484 0.4392 0.2455 2.3305 3.5900 3.5008 2.8560 7.0360 1.1069 1.5069 0.1641 4.2081 14.7453 0.6197 1.2302 6.3638 7.0356 4.1689 2.9840 1.8207 11.6503 1.9360 2.7633 10.1720 4.4231 17.8759 15.2083 5.4911 17.2842 6.6999 9.4146 31.7705 3.7761 2.5058 73.5031 57.9800 12.6060 85.9003 56.6660 39.0877 7.1177 3.0081 21.4199 62.1659 0.1831 3.1510 15.4926 2.1949 12.8187 22.3015 14.1445 8.4460 3.6813 0.4647 31.8836 44.8622 6.0410 1.1811 14.7699 45.9534 15.1362 1.7513 7.5449 21.1206 8.2935 32.1507 27.0282 21.4743 77.9451 12.8599 28.4242 80.1134 0.2875 129.8733 203.0482 26.6608 83.5907 11.3640 33.4028 150.3212 52.1284 69.7804 27.2724 433.5993 236.1581 27.1529 8.5072 242.5149 113.5883 44.7513 19.6830 9.8147 1.0897 0.7425 7.2094 23.9350 2.7145 0.7362 2.1094 0.9114 0.6148 2.3766 39.8159 27.5480
temp: 298.150 k
press: 1.00000 atm
elementType: 16 8 8 8 8 7 7 6 6 6 6 6 6 6 6 6 6 6 6 6 6 6 6 6 6 1 1 1 1 1 1 1 1 1 1 1 1 1 1
symmnumber: 1
zpe: 752880.8 jmol-1
zpe.correction: 0.286757 hartree
zpe.thermalcorrener: 0.307688 hartree
zpe.thermalcorrenthalpy: 0.308633 hartree
zpe.thermalcorrgfe: 0.236070 hartree
zpe.sumelectzpe: -1501.006139 hartree
zpe.sumelectthermal: -1500.985208 hartree
zpe.sumelectthermalent: -1500.984263 hartree
zpe.sumelectthermalfe: -1501.056826 hartree
dipole: -3.5359 -3.5087 1.7334
dipole: 5.2743
quadrupole: -146.6128 -149.1590 -154.4647
quadrupole: 22.6062 3.1956 -4.4378
quadrupole: 3.4661 0.9198 -4.3859 22.6062 3.1956 -4.4378
hfenergy: -1501.2928961 hartree
pointgroup: C01 [X(C18H14N2O4S1)]
dipole: 1.2730329 1.5007171 0.658113 debye
polarizability: 367.1147852|8.9451873|301.07273|7.2287695|-18.174756|116.1374109 unknown
InChI: InChI=1S/C18H14N2O4S/c21-17-15-6-4-13(23-15)9-25-10-14-5-7-16(24-14)18(22)20-12-3-1-2-11(8-12)19-17/h1-8,19-20H,9-10H2
charge 0 multiplicity 1
39 atoms
S  1.636194 3.160554 -0.587411
O  -1.530232 1.356659 0.286487
O  2.780934 0.38984 0.147571
O  -5.046346 0.831665 -0.687146
O  2.806381 -3.225203 0.235874
N  -3.625197 -0.918593 -0.284022
N  1.179307 -1.595837 -0.340571
C  -0.960236 2.641769 0.432581
C  3.778839 1.373111 0.071062
C  0.457606 2.694949 0.877152
C  3.311352 2.782607 0.250644
C  -2.491562 -1.762199 -0.091562
C  -0.0813 -2.207361 -0.142554
C  -2.863545 1.536311 -0.162691
C  3.407324 -0.878946 0.001819
C  -1.187334 -1.371364 -0.436197
C  -1.910247 3.600443 0.089243
C  5.008707 0.74606 -0.103475
C  -3.109082 2.904342 -0.285579
C  4.773306 -0.682786 -0.13597
C  -3.858474 0.460123 -0.394525
C  2.465934 -2.031171 -0.01766
C  -2.703645 -3.067466 0.436413
C  -0.276204 -3.513552 0.370204
C  -1.602207 -3.926568 0.634784
H  0.60371 3.467672 1.648616
H  0.779677 1.712191 1.253796
H  3.184461 3.039908 1.318707
H  4.037992 3.489163 -0.180688
H  -1.007462 -0.396188 -0.889386
H  -1.756052 4.677549 0.100087
H  5.972436 1.242919 -0.196837
H  -4.059278 3.3272 -0.601989
H  5.513006 -1.468898 -0.269359
H  -4.520384 -1.414228 -0.37033
H  1.125131 -0.602129 -0.58685
H  -3.715499 -3.396648 0.700526
H  0.580859 -4.162431 0.561581
H  -1.776769 -4.932963 1.030452
