program: Gaussian 09
title: 000152840
version: EM64L-G09RevD.01
frameworkgroup: C1[X(C21H21ClO6)]
method: RPBEPBE
basis: SDD
operation: Freq
keyword: #p
keyword: freq=noraman
keyword: PBEPBE/SDD
title: #p freq=noraman PBEPBE/SDD
converged: YES YES NO NO
title: Mulliken charges:
elementType: Cl O O O O O O C C C C C C C C C C C C C C C C C C C C C H H H H H H H H H H H H H H H H H H H H H
charge: -0.052910 -0.300098 -0.265240 -0.413600 -0.402759 -0.455731 -0.199549 0.276694 0.189507 0.040857 0.131199 -0.045150 0.240148 0.265150 -0.616485 0.488451 0.128296 -0.519367 0.121007 0.281968 -0.639102 -0.850696 -0.478686 -0.389756 -0.790017 0.369615 -0.780393 -0.782195 0.237520 0.247623 0.286877 0.233974 0.286071 0.231961 0.224253 0.231733 0.270380 0.235118 0.271759 0.242738 0.360397 0.365123 0.235165 0.225090 0.223839 0.232756 0.231508 0.227378 0.347582
chargesum: 0.00000
title: Mulliken charges with hydrogens summed into heavy atoms:
elementType: Cl O O O O O O C C C C C C C C C C C C C C C C C C C C C
charge: -0.052910 -0.300098 -0.265240 -0.053203 -0.037636 -0.108149 -0.199549 0.276694 0.189507 0.040857 0.131199 -0.045150 0.240148 0.265150 -0.131342 0.488451 0.128296 -0.232490 0.121007 0.281968 -0.639102 -0.098690 -0.022700 -0.119376 -0.040401 0.369615 -0.096300 -0.090554
polarizability: 3.89996091e+02 1.47457334e+01 2.75556985e+02 5.95743698e+00 4.10895281e+00 1.72545188e+02
1716.lowfreq: -4.9919 -2.3314 -0.0011 -0.0003 0.0009 4.0630 17.9216 28.0833 37.1198
frequency: 17.8555 28.0064 37.1139 43.2568 46.8682 62.7134 73.0424 83.6998 96.4703 100.6092 109.2034 128.1128 129.1518 159.9698 163.7585 168.4776 172.5281 185.6313 187.5097 209.4661 230.8001 240.4023 256.3300 271.9674 282.0818 296.6354 308.0840 317.0014 323.9289 325.5442 334.5611 359.4311 369.5778 390.4927 404.3446 424.2648 425.9754 448.1108 472.9416 483.9582 494.6354 506.3990 520.4783 533.7211 554.3525 578.0965 583.2294 603.3765 616.7959 626.7982 638.9656 670.3286 679.6224 695.2999 715.8509 726.0908 763.4651 787.3936 793.6840 832.3394 854.7919 868.1482 880.1223 924.1495 930.5577 940.6616 947.5607 977.7009 1000.2031 1003.2374 1015.1746 1025.1924 1037.5642 1039.2177 1045.2197 1057.5755 1069.6186 1081.2403 1089.2213 1109.9951 1156.6015 1177.9265 1183.1660 1195.6987 1205.7319 1224.8527 1230.2402 1247.9826 1263.0486 1291.6158 1316.7978 1339.0879 1358.4854 1365.2054 1385.2381 1387.9592 1390.7927 1398.3789 1401.2630 1406.1108 1410.5267 1425.8233 1446.4255 1448.6058 1454.2272 1454.5742 1461.1870 1463.7964 1466.2604 1470.8945 1473.6048 1476.2362 1479.3173 1492.6121 1574.6388 1595.7158 1600.7302 1617.1060 1632.7769 1670.5561 2964.7567 2971.4913 2980.7797 2981.1042 2995.8437 3008.1273 3037.6343 3038.0987 3043.0895 3053.5147 3057.7248 3083.7317 3089.5900 3093.0003 3095.9044 3115.0783 3120.0181 3194.6232 3306.0581 3478.6058 3554.0955
redmass: 6.0997 3.2191 4.6360 4.3769 4.9118 5.0721 5.3414 3.7321 3.6613 1.3812 3.0000 1.3254 2.0817 1.3792 1.1539 1.3241 2.4609 4.3005 8.0496 6.3116 5.9219 3.7414 3.5052 4.0432 2.5351 4.6060 7.9480 5.0812 5.6054 4.4953 5.1695 5.8065 4.2209 6.1340 2.9148 5.1772 6.1817 2.7463 6.5151 1.1869 4.1796 3.7462 4.3811 3.8047 4.7434 6.2617 7.4700 4.7977 1.2585 4.9009 5.7669 5.6705 7.4010 5.6170 9.0380 4.0946 4.5896 2.4023 7.0657 4.4652 1.6418 1.9086 2.9778 2.1094 6.9981 3.5766 1.3848 3.3961 2.5210 1.4932 2.3607 2.4757 1.5935 1.5337 2.1121 2.1071 3.5239 1.6760 4.7287 2.2133 1.4056 1.6502 1.4995 3.0685 1.2942 2.4183 1.7424 1.8178 1.5244 1.5864 6.1616 5.6923 1.4699 6.6569 4.1774 3.2818 1.2780 1.2211 1.2207 1.2923 1.3798 2.7581 4.3123 1.1223 2.7517 1.0683 1.2590 1.0513 1.1686 1.0609 1.0777 1.1635 1.2987 1.0553 6.7156 9.1347 9.3247 6.9584 11.7403 6.0730 1.0375 1.0389 1.0399 1.0615 1.0565 1.0380 1.0959 1.0964 1.0961 1.0977 1.1071 1.0935 1.0944 1.0953 1.0970 1.0960 1.1008 1.0932 1.0664 1.0645 1.0666
irintensity: 0.8031 0.5762 0.5245 1.5388 0.7716 0.7901 2.3874 3.3345 0.3364 0.7858 0.7412 2.5373 0.6257 77.7556 20.0830 30.3438 8.0750 3.6724 0.7465 0.0641 3.1780 1.6145 0.8108 7.6374 1.4085 1.0127 0.8259 0.3437 11.0310 8.4109 4.6239 1.7867 1.1323 2.6338 0.4991 0.9784 1.8260 6.8923 3.3423 120.2223 2.3196 3.3162 23.5120 14.1344 11.0535 22.0947 16.8969 13.5535 84.8980 1.1197 0.4348 10.3572 47.1877 39.1816 18.4438 4.3537 1.8270 0.9222 4.4035 11.3810 25.2544 10.6146 19.4912 14.9209 33.6698 91.4515 0.7488 59.3195 80.6942 7.8578 2.0254 4.5548 20.3150 2.7758 43.1288 138.5046 4.4993 3.8712 335.9721 40.3153 102.2178 43.4164 160.8331 1.9938 79.6092 348.2034 9.4063 112.2665 97.3505 3.1202 17.5325 16.7769 5.3157 67.3300 51.4584 14.0218 29.7097 13.7091 8.5274 34.4727 14.9044 157.7636 51.2066 8.8528 28.2311 3.8657 43.1440 18.3850 9.0318 18.6673 15.1809 25.8653 103.4409 16.1517 66.6146 16.6030 188.3483 53.1488 368.2413 8.5001 33.2920 43.5554 25.4274 26.0879 46.6382 5.6721 15.1026 1.6526 27.2978 15.5939 13.6972 5.4524 33.0659 7.6017 35.2437 5.8862 10.6191 3.3163 631.1642 91.6512 4.6716
temp: 298.150 k
press: 1.00000 atm
elementType: 17 8 8 8 8 8 8 6 6 6 6 6 6 6 6 6 6 6 6 6 6 6 6 6 6 6 6 6 1 1 1 1 1 1 1 1 1 1 1 1 1 1 1 1 1 1 1 1 1
symmnumber: 1
zpe: 976706.8 jmol-1
zpe.correction: 0.372008 hartree
zpe.thermalcorrener: 0.400681 hartree
zpe.thermalcorrenthalpy: 0.401626 hartree
zpe.thermalcorrgfe: 0.311836 hartree
zpe.sumelectzpe: -1722.160967 hartree
zpe.sumelectthermal: -1722.132293 hartree
zpe.sumelectthermalent: -1722.131349 hartree
zpe.sumelectthermalfe: -1722.221138 hartree
dipole: -3.2671 -2.2967 2.8034
dipole: 4.8794
quadrupole: -127.5759 -170.7304 -172.4685
quadrupole: -12.0576 -1.4380 11.7976
quadrupole: 29.3490 -13.8054 -15.5436 -12.0576 -1.4380 11.7976
hfenergy: -1722.5329746 hartree
pointgroup: C01 [X(C21H21Cl1O6)]
dipole: -1.3264027 -0.8612551 1.0881737 debye
polarizability: 388.2877265|17.3308057|276.3024937|16.1521903|-1.0244963|173.508043 unknown
InChI: InChI=1S/C21H21ClO6/c1-9(2)5-6-12-10(3)19-15(7-14(12)24)27-20-13(8-23)18(25)17(22)11(4)16(20)21(26)28-19/h5,7,23-25H,6,8H2,1-4H3
charge 0 multiplicity 1
49 atoms
Cl 5.805954 0.262202 2.125486
O  1.083901 -0.567791 -1.512102
O  0.426559 2.182369 -1.139074
O  -3.28951 -1.862074 0.063968
O  4.816918 -2.312511 0.942884
O  1.464017 -3.305586 0.134434
O  2.41382 3.255766 -1.184881
C  -2.729327 0.549969 0.002881
C  -1.760603 1.557834 -0.275693
C  -0.486238 1.159428 -0.752049
C  2.179249 -0.312045 -0.651537
C  2.495848 1.018393 -0.256714
C  -0.185462 -0.20085 -0.961396
C  2.942465 -1.436592 -0.274296
C  -4.100798 0.89999 0.583675
C  3.615035 1.241117 0.616598
C  -2.392174 -0.821108 -0.214211
C  -1.118338 -1.20336 -0.685188
C  1.818372 2.204046 -0.87298
C  4.055036 -1.212832 0.570565
C  4.348512 0.105873 1.007551
C  -2.056243 3.035266 -0.077786
C  2.572945 -2.825618 -0.731787
C  -5.266425 0.210962 -0.119534
C  3.997886 2.624155 1.102945
C  -6.367187 -0.369155 0.452818
C  -7.47168 -0.953243 -0.412932
C  -6.607428 -0.474725 1.948773
H  -4.11024 0.658737 1.665404
H  -4.253397 1.992484 0.516951
H  -0.849238 -2.25473 -0.8029
H  -2.279724 3.26461 0.981023
H  -1.195443 3.645956 -0.387624
H  -2.929121 3.355416 -0.676845
H  2.232764 -2.790684 -1.783963
H  3.453196 -3.487013 -0.637124
H  -5.223174 0.253081 -1.218667
H  4.575277 2.566702 2.038446
H  4.610341 3.142783 0.3443
H  3.110222 3.255015 1.265822
H  -4.218939 -1.494208 0.147375
H  5.556366 -2.029317 1.546179
H  -7.246078 -0.859905 -1.488805
H  -7.632818 -2.024935 -0.183929
H  -8.434467 -0.440841 -0.217599
H  -5.746337 -0.153009 2.55632
H  -7.475175 0.150037 2.239481
H  -6.8599 -1.514672 2.232084
H  1.38888 -4.288887 0.031856
