program: Gaussian 09
title: 000013664
version: EM64L-G09RevD.01
frameworkgroup: C1[X(C12H13N)]
method: RPBEPBE
basis: SDD
operation: Freq
keyword: #pfreq=noraman
keyword: PBEPBE/SDD
title: #p freq=noraman PBEPBE/SDD
converged: YES YES NO NO
title: Mulliken charges:
elementType: N C C C C C C C C C C C C H H H H H H H H H H H H H
charge: -0.483914 0.142605 0.190668 -0.508832 -0.500809 -0.411480 -0.398694 0.142958 0.213578 -0.420845 -0.368799 -0.254501 -0.224660 0.213594 0.216165 0.223434 0.217036 0.204055 0.206482 0.205164 0.211682 0.294855 0.229705 0.226476 0.216322 0.217756
chargesum: 0.00000
title: Mulliken charges with hydrogens summed into heavy atoms:
elementType: N C C C C C C C C C C C C
charge: -0.189059 0.142605 0.190668 -0.079073 -0.060339 -0.000943 0.018152 0.142958 0.213578 -0.191139 -0.142323 -0.038179 -0.006905
polarizability: 1.90654892e+02 7.75742584e+00 1.36055850e+02 3.75231895e-01 1.55763593e+00 7.10070215e+01
1716.lowfreq: -8.2929 -6.5130 -3.1466 0.0003 0.0007 0.0008 77.5070 129.1436 177.2230
frequency: 77.4789 129.1331 177.2158 196.5145 265.0669 308.4941 317.7251 377.5164 428.3787 454.3586 489.7671 493.9124 536.3223 576.1624 590.5990 631.2426 667.2017 709.9210 746.2874 756.9144 817.5981 824.3089 848.3270 857.4125 887.4949 908.8162 926.7887 963.0695 966.6540 982.9457 1011.4424 1078.4056 1088.5282 1109.5834 1131.3338 1151.9353 1152.8918 1171.0941 1211.7302 1235.8681 1237.5760 1254.2400 1282.0476 1307.5877 1335.1451 1338.5062 1343.2661 1365.6470 1409.3046 1436.7517 1458.6566 1463.6855 1467.5591 1474.0237 1475.4658 1481.8236 1580.1433 1599.8629 1634.0484 2948.1203 2951.3407 2977.0980 2981.0466 3000.5065 3006.5998 3040.1913 3049.9322 3118.7619 3126.2697 3140.6063 3159.0530 3605.4439
redmass: 3.2328 2.8420 2.6619 4.1477 2.7290 2.5831 2.6017 4.3880 2.8534 2.6998 2.4466 1.4909 3.9832 3.4325 4.0262 3.7037 3.7564 3.6755 1.3252 3.8037 3.6518 1.4461 1.4636 2.7919 3.4409 1.4811 1.3871 2.3531 1.2999 3.3787 2.0287 1.8275 1.9983 1.7743 1.1438 1.3164 1.9612 1.3479 1.4314 1.5572 1.7749 1.2742 1.7520 1.5637 1.4664 1.4317 1.6597 2.1105 3.7634 2.7049 1.1430 1.3506 1.1058 1.4437 2.0939 2.5537 6.5476 6.5887 6.6875 1.0612 1.0640 1.0643 1.0686 1.0907 1.0934 1.0993 1.1042 1.0845 1.0889 1.0950 1.1001 1.0803
irintensity: 1.0734 0.1479 3.8512 0.4878 1.3335 0.2234 1.7297 0.8739 6.9704 1.0642 26.3666 61.4093 3.8705 5.1255 0.9108 9.9307 1.5969 2.4396 102.5817 4.8773 0.1870 5.5736 0.1297 1.7542 1.8391 0.6303 2.9977 4.2612 0.0256 2.5697 9.7054 0.1886 1.2886 4.1277 3.5549 2.7277 7.1745 2.8081 4.1439 17.2140 3.8698 2.4597 2.6314 12.6673 6.0560 1.2043 31.1301 12.3175 18.2362 19.9792 2.1750 14.7163 5.9254 9.7863 25.4293 6.8344 0.7952 10.7219 2.4577 61.1107 38.4039 29.4544 22.0698 62.4227 29.8570 79.4282 67.1945 2.0644 4.6829 40.6282 34.8103 42.5935
temp: 298.150 k
press: 1.00000 atm
elementType: 7 6 6 6 6 6 6 6 6 6 6 6 6 1 1 1 1 1 1 1 1 1 1 1 1 1
symmnumber: 1
zpe: 576042.3 jmol-1
zpe.correction: 0.219403 hartree
zpe.thermalcorrener: 0.229495 hartree
zpe.thermalcorrenthalpy: 0.230439 hartree
zpe.thermalcorrgfe: 0.184141 hartree
zpe.sumelectzpe: -518.919591 hartree
zpe.sumelectthermal: -518.909499 hartree
zpe.sumelectthermalent: -518.908555 hartree
zpe.sumelectthermalfe: -518.954853 hartree
dipole: -1.9233 -1.7987 -0.0524
dipole: 2.6338
quadrupole: -72.2745 -65.4527 -81.6157
quadrupole: -0.2818 -0.0241 0.5087
quadrupole: 0.8398 7.6616 -8.5014 -0.2818 -0.0241 0.5087
hfenergy: -519.1389937 hartree
pointgroup: C01 [X(C12H13N1)]
dipole: 0.7626124 0.7010938 -0.0259304 debye
dipolederiv: -0.6267817 0.1469211 -0.0155389 -0.1841063 -0.5588095 0.007102 0.0045952 0.0209174 -0.2831873 -0.1861064 -0.2331943 0.0186391 -0.2089936 -0.0972448 0.0004037 0.0712622 -0.0356197 -0.147308 0.2351423 -0.2628991 0.0064856 -0.0056051 0.4937914 -0.021297 -0.0960862 -0.0424811 -0.0592554 0.0368034 -0.0486813 0.0191303 -0.0686557 0.1302688 -0.0086664 0.0069799 0.0088322 0.195148 0.042147 0.1225883 -0.0332517 0.0413972 0.0533311 0.0184244 0.038484 0.0446122 0.1972094 0.1197691 -0.026565 0.0168854 -0.0027158 0.0401798 -0.0284577 -0.0343175 -0.0157164 0.136177 0.148741 -0.0203686 -0.0234742 -0.0794649 0.0309442 -0.0222579 0.0264708 -0.0313275 0.1321899 0.3634037 0.1848739 -0.0055316 -0.2164169 -0.2170819 0.0040333 0.0133963 0.0112177 0.0030881 0.0914528 0.1773049 -0.0013753 0.66214 0.1639559 0.0006729 -0.0248557 -0.0062678 0.0411748 0.0497414 -0.0120664 0.0007754 0.0211103 0.0853587 -0.0139789 -0.0032992 -0.0118602 -0.1765903 0.1316118 -0.0602238 -0.0007246 -0.0250956 0.0401099 -0.0113277 0.002539 -0.0099061 -0.2025553 -0.0939646 0.0575683 -0.0002717 0.1203789 0.0349084 -0.0091489 -0.0042817 -0.0092829 -0.1928558 -0.0852985 -0.0323612 0.0014095 -0.133412 0.0141619 -0.005668 0.0032933 -0.0076802 -0.1940664 -0.0027985 0.0546908 -0.0052853 0.0657781 -0.0173229 0.0772716 -0.0306556 0.1404904 -0.1227251 0.0062607 -0.0693303 -0.0480851 -0.0076602 -0.0997244 -0.0897765 -0.0134308 -0.1300614 0.0076149 -0.086916 -0.0629849 0.0388786 -0.0451558 0.0275885 0.059467 0.0935251 0.1245073 -0.115083 -0.0149943 -0.0159181 0.0037551 -0.0542957 -0.1249925 -0.1041158 -0.0662703 -0.1486143 0.0094157 -0.1229975 0.1327785 -0.0175253 0.1626197 -0.0926912 0.0170881 -0.0517392 0.0362846 0.0731895 0.0606275 -0.025098 -0.009492 -0.0582259 0.0498018 0.051789 0.0410428 0.0004385 -0.1801583 -0.2460657 -0.0675408 0.0213561 -0.071663 0.0327895 0.0075392 0.0611841 0.0145552 0.0742482 0.0976413 0.0121681 0.0346277 0.0342448 0.0220815 0.0342006 -0.0360548 0.0138607 -0.1744258 0.153502 0.0044293 0.0001862 0.0137684 0.1729185 0.0043829 -0.0010199 0.0011062 0.3230912 0.0743777 0.0773662 -0.0041326 0.0352535 -0.102274 0.010286 -0.0022057 0.0098045 0.1522236 0.057664 0.0303796 -0.0007432 0.0811438 -0.1187665 0.0110197 -0.0023602 0.0110652 0.1740018 -0.0528405 -0.1170186 0.004786 -0.129137 -0.0367972 0.007661 0.0055154 0.0074158 0.1643343 -0.150122 0.0531812 -0.0014834 0.0527687 0.0735152 0.0033531 -0.0017116 0.0037099 0.165104 unknown
polarizability: 190.7813471|7.2923134|135.9035767|-0.4943806|-2.0193009|71.0328392 unknown
InChI: InChI=1S/C12H13N/c1-3-7-11-9(5-1)10-6-2-4-8-12(10)13-11/h1,3,5,7,13H,2,4,6,8H2
charge 0 multiplicity 1
26 atoms
N  -0.013098 1.685073 -0.060393
C  0.713105 -0.480566 0.018785
C  1.121364 0.852456 -0.03065
C  1.693032 -1.630054 0.061138
C  2.543582 1.34311 -0.059796
C  3.111054 -1.145574 -0.347162
C  3.49044 0.182689 0.3564
C  -0.737422 -0.485128 0.023233
C  -1.168687 0.891611 -0.02944
C  -1.721671 -1.507966 0.061676
C  -2.531241 1.25707 -0.040156
C  -3.084775 -1.149051 0.049395
C  -3.486057 0.218362 -0.000373
H  1.730316 -2.068853 1.080746
H  1.367753 -2.44768 -0.612525
H  2.812207 1.695269 -1.078479
H  2.685153 2.208806 0.619102
H  3.858431 -1.925409 -0.10543
H  3.143314 -0.993158 -1.44481
H  4.535989 0.456128 0.118572
H  3.430216 0.040097 1.453537
H  0.005263 2.701953 -0.095625
H  -1.42699 -2.563063 0.102251
H  -2.845401 2.306585 -0.078977
H  -3.853043 -1.930135 0.078929
H  -4.553531 0.466329 -0.008251
