program: Gaussian 09
title: 000152786
version: EM64L-G09RevD.01
frameworkgroup: C1[X(C20H23ClN4O)]
method: RPBEPBE
basis: SDD
operation: Freq
keyword: #p
keyword: freq=noraman
keyword: PBEPBE/SDD
title: #p freq=noraman PBEPBE/SDD
converged: YES YES NO NO
title: Mulliken charges:
elementType: Cl O N N N N C C C C C C C C C C C C C C C C C C C C H H H H H H H H H H H H H H H H H H H H H H H
charge: -0.058718 -0.255340 -0.086120 -0.415565 -0.059540 -0.058138 -0.372070 -0.348157 -0.437502 -0.450131 -0.354070 -0.484618 -0.297547 0.334949 0.275785 -0.083934 -0.091290 0.017717 -0.324598 -0.299548 -0.234180 -0.289346 -0.106863 0.054740 -0.310316 -0.506620 0.179117 0.227666 0.220808 0.177281 0.209127 0.229273 0.226330 0.209602 0.179934 0.219941 0.210304 0.229013 0.228660 0.226783 0.306619 0.195043 0.290643 0.275060 0.255599 0.257919 0.229053 0.232503 0.224743
chargesum: 0.00000
title: Mulliken charges with hydrogens summed into heavy atoms:
elementType: Cl O N N N N C C C C C C C C C C C C C C C C C C C C
charge: -0.058718 -0.255340 -0.086120 -0.108946 -0.059540 -0.058138 0.034713 0.049933 0.000899 -0.014199 0.045805 -0.045301 0.157896 0.334949 0.275785 -0.083934 -0.091290 0.017717 -0.129556 -0.008905 0.040880 -0.033747 -0.106863 0.054740 -0.052398 0.179679
polarizability: 3.19518552e+02 -3.19529357e+01 4.00124727e+02 2.67253430e+01 9.81158915e+00 1.44046123e+02
1716.lowfreq: -7.6942 -6.0450 -2.0768 -0.0001 0.0009 0.0011 9.0292 13.2732 19.2596
frequency: 8.4740 13.2163 19.1951 31.9841 34.9133 55.1084 77.9086 84.7218 97.2307 114.2789 131.8139 138.5719 143.4158 157.7136 176.4508 186.5567 212.8604 229.2312 252.4595 282.8507 287.5480 297.5198 324.8216 334.9833 376.0990 394.1861 402.2117 415.4637 429.6969 442.2185 462.7546 492.7420 509.8181 552.3735 572.3937 595.4676 614.1264 617.6040 635.4167 639.8988 671.7154 677.1013 685.1190 734.8851 752.1443 764.7547 772.0599 781.5818 807.9820 839.9142 847.3822 852.9174 864.6906 877.7121 889.5134 893.5427 898.7397 927.8282 930.0782 958.6134 970.4518 975.1899 984.1167 1008.7903 1053.1192 1063.6935 1064.7335 1080.2574 1088.3164 1094.5970 1102.0244 1113.3223 1136.6696 1143.1841 1148.7492 1151.8431 1168.4038 1187.7410 1191.0919 1206.0780 1225.1905 1227.5414 1232.0178 1233.2087 1253.2769 1253.9847 1276.6653 1282.7898 1287.8464 1289.5038 1294.8373 1307.4116 1326.1987 1330.6833 1347.7327 1358.3491 1380.4226 1386.9916 1396.6957 1414.2213 1431.2414 1448.0576 1453.8383 1456.4089 1463.4862 1464.9108 1466.8268 1476.6954 1480.0404 1481.3109 1481.8830 1496.3545 1504.6633 1521.0396 1546.7129 1563.1106 1597.4447 1613.5442 2818.6781 2830.7984 2850.2385 2975.1509 2989.5017 2996.8918 3001.9917 3012.6691 3024.3629 3034.8907 3044.0278 3048.6804 3068.1943 3075.2667 3086.2430 3093.4961 3115.4800 3135.5354 3161.9417 3174.8681 3182.4923 3185.9901 3544.7629
redmass: 4.3461 5.2322 2.5496 4.4454 1.8010 5.0594 3.6569 3.7280 3.9735 4.3522 3.7706 3.8099 1.7002 2.4945 2.6899 4.3788 2.0638 2.2340 6.5230 5.1610 6.6716 4.8223 2.7171 3.4862 3.0911 5.2469 4.0480 3.6448 5.3653 1.9309 5.9414 5.5765 2.2940 5.0865 3.8373 5.3622 4.8570 3.5193 2.9840 6.4032 5.5600 7.7027 4.9612 2.9714 1.4196 5.1933 2.0744 1.3540 3.7705 1.7372 1.9416 1.7051 5.6257 2.6027 4.2722 1.4925 2.5739 1.3872 3.2296 2.6539 1.6689 2.8645 1.3186 2.8031 3.3263 2.6062 2.0928 2.2977 1.9612 1.6332 2.1694 1.2587 2.3893 1.6105 2.0669 1.6668 1.8893 1.3748 1.2977 1.3555 1.4158 1.7123 1.4273 2.3391 4.2109 1.3512 1.4972 2.0351 1.8299 1.3089 1.3237 1.3502 1.5837 1.4482 1.4492 2.5526 6.0021 1.4808 6.8135 1.6690 2.4338 1.0565 2.2384 1.6663 1.0827 1.1182 1.2563 1.1093 1.0807 1.0962 1.0968 1.1046 6.6596 6.8585 4.4652 3.5602 5.6814 7.2004 1.0716 1.0712 1.0708 1.0633 1.0314 1.0669 1.0846 1.0599 1.0674 1.0863 1.0893 1.0943 1.1049 1.0968 1.1037 1.1054 1.0880 1.1034 1.0886 1.0948 1.0931 1.0993 1.0746
irintensity: 0.7463 0.0397 0.2931 0.0695 0.3014 0.2101 0.1413 0.2469 0.1263 0.3925 1.4788 4.5277 3.3153 5.1897 0.9094 3.1321 1.8347 1.7370 3.6558 1.0477 3.0768 10.5467 10.6264 1.9907 3.0185 0.7213 2.6781 2.1941 8.0185 37.4610 10.5641 14.1635 43.9720 5.2963 25.5642 4.1982 4.8760 0.7423 0.2366 1.7008 3.2315 11.8615 15.4009 13.2303 2.0869 10.3584 18.9752 2.9774 21.1327 44.4939 11.1919 10.3015 9.2160 4.1867 78.7624 23.6970 6.3959 1.7536 22.8718 3.8222 2.6614 36.3359 0.7087 18.6878 10.5404 7.4524 26.3371 7.1199 15.4739 0.5868 25.8255 0.2602 12.0146 4.6005 43.2523 39.8846 12.2299 1.7580 6.2451 3.3296 2.2290 12.0524 20.3039 97.3119 109.9520 19.4729 16.5669 8.2275 4.6919 3.6135 5.5651 2.7103 39.8996 2.2119 1.5018 169.7759 76.6630 4.1503 11.6401 16.7579 41.5072 15.8892 144.1374 13.7439 22.8530 7.6654 13.9645 4.7875 9.9787 61.8295 28.0368 5.0021 56.9626 125.3204 415.5627 28.3219 6.7551 180.6033 48.9916 67.0107 176.3469 22.1907 35.6194 52.1168 18.4389 18.9495 74.9583 50.7057 22.0674 54.6238 0.9430 18.8791 41.5212 72.5472 14.9803 32.9277 0.3426 4.5502 1.3860 9.3993 34.6288
temp: 298.150 k
press: 1.00000 atm
elementType: 17 8 7 7 7 7 6 6 6 6 6 6 6 6 6 6 6 6 6 6 6 6 6 6 6 6 1 1 1 1 1 1 1 1 1 1 1 1 1 1 1 1 1 1 1 1 1 1 1
symmnumber: 1
zpe: 1039029.9 jmol-1
zpe.correction: 0.395746 hartree
zpe.thermalcorrener: 0.420258 hartree
zpe.thermalcorrenthalpy: 0.421203 hartree
zpe.thermalcorrgfe: 0.336457 hartree
zpe.sumelectzpe: -1528.310252 hartree
zpe.sumelectthermal: -1528.285739 hartree
zpe.sumelectthermalent: -1528.284795 hartree
zpe.sumelectthermalfe: -1528.369540 hartree
dipole: -6.6862 1.8204 -0.5952
dipole: 6.9551
quadrupole: -161.0821 -160.6757 -162.4221
quadrupole: 5.4977 -0.1972 -0.7254
quadrupole: 0.3112 0.7176 -1.0288 5.4977 -0.1972 -0.7254
hfenergy: -1528.7059972 hartree
pointgroup: C01 [X(C20H23Cl1N4O1)]
dipole: -2.550463 0.9763955 -0.1714839 debye
polarizability: 314.8089262|-23.9829964|405.0309985|24.4513156|14.3291025|143.8494768 unknown
InChI: InChI=1S/C20H23ClN4O/c1-26-18-8-7-16-20(24-18)19(15-6-5-14(21)13-17(15)23-16)22-9-4-12-25-10-2-3-11-25/h5-8,13,22H,2-4,9-12H2,1H3
charge 0 multiplicity 1
49 atoms
Cl 3.880601 -5.300711 -0.216709
O  1.261427 4.809497 0.220202
N  -4.628261 -0.781467 0.09177
N  -0.452819 0.059417 -0.688039
N  3.730265 -0.153761 0.308887
N  1.066957 2.469599 -0.056997
C  -5.088723 -1.614977 1.234976
C  -5.7994 0.068991 -0.250969
C  -6.527874 -2.028173 0.835178
C  -7.004361 -0.902822 -0.146573
C  -3.369622 -0.056546 0.344274
C  -2.835151 0.653667 -0.91908
C  -1.400613 1.193491 -0.750233
C  0.88262 0.032969 -0.350709
C  1.572043 -1.246648 -0.310921
C  1.657326 1.205694 -0.035376
C  2.99041 -1.27188 0.01168
C  3.065175 1.039963 0.287125
C  0.917235 -2.497715 -0.570026
C  3.685414 -2.531925 0.032741
C  3.818521 2.233596 0.59796
C  1.603968 -3.712063 -0.542141
C  2.998639 -3.703054 -0.242035
C  1.81445 3.530657 0.234396
C  3.212524 3.476953 0.577656
C  -0.166834 4.90571 -0.128637
H  -5.107581 -1.026435 2.188782
H  -4.413093 -2.476443 1.383332
H  -5.691983 0.506895 -1.258597
H  -5.915184 0.912416 0.479628
H  -7.18075 -2.11824 1.720615
H  -6.520907 -3.00504 0.322689
H  -7.240427 -1.331345 -1.135309
H  -7.907202 -0.382069 0.216982
H  -3.481626 0.701157 1.166414
H  -2.621212 -0.793247 0.697562
H  -2.884252 -0.05392 -1.772764
H  -3.4911 1.504997 -1.180524
H  -1.311072 1.797267 0.167551
H  -1.137496 1.862893 -1.591021
H  -0.849407 -0.824621 -1.008774
H  -0.157082 -2.545356 -0.785431
H  4.751097 -2.514971 0.272712
H  4.876345 2.104365 0.844276
H  1.089553 -4.65663 -0.738258
H  3.744928 4.403657 0.804764
H  -0.352128 4.488143 -1.133734
H  -0.386982 5.982958 -0.103168
H  -0.784756 4.361008 0.60707
