program: Gaussian 09
title: 000152768
version: EM64L-G09RevD.01
frameworkgroup: C1[X(C6H11N3O2)]
method: RPBEPBE
basis: SDD
operation: Freq
keyword: #p
keyword: freq=noraman
keyword: PBEPBE/SDD
title: #p freq=noraman PBEPBE/SDD
converged: NO YES NO NO
title: Mulliken charges:
elementType: O O N N N C C C C C C H H H H H H H H H H H
charge: -0.417346 -0.223072 -0.479925 -0.396389 -0.136529 -0.363567 -0.456337 0.281493 -0.299317 -0.529546 0.192197 0.217859 0.217839 0.218937 0.218563 0.246539 0.248671 0.280754 0.292251 0.251743 0.256227 0.378958
chargesum: 0.00000
title: Mulliken charges with hydrogens summed into heavy atoms:
elementType: O O N N N C C C C C C
charge: -0.038389 -0.223072 -0.199172 -0.104137 -0.136529 0.072131 -0.018838 0.281493 0.195892 -0.021577 0.192197
polarizability: 1.24594866e+02 -3.80343720e+00 9.20535655e+01 -6.00378008e-02 -2.70630144e-02 5.67690725e+01
1716.lowfreq: -295.3922 -111.0280 -1.9282 0.0007 0.0008 0.0008 5.7495 11.9199 19.3580
frequency: -295.3918 -111.0172 15.6018 36.9011 64.0440 75.5300 130.1933 195.2630 241.4148 249.2688 257.6266 409.3913 498.8680 509.0288 592.4765 636.9426 652.8475 718.3087 739.3314 783.1281 830.5753 872.0724 899.2544 935.3634 1012.5615 1038.4667 1060.2443 1069.9771 1085.9442 1102.7683 1133.0024 1173.0751 1192.2238 1204.9247 1229.2213 1255.3283 1262.2691 1272.0372 1300.4779 1328.2880 1383.2216 1418.4796 1445.4306 1480.9659 1501.0791 1501.7838 1533.5139 1635.6101 1674.0252 2964.4658 2985.7285 2991.7820 3003.1010 3005.6184 3030.2300 3041.0615 3058.8549 3516.1171 3603.7483 3612.2970
redmass: 1.1769 1.7993 6.9549 3.4628 2.3769 5.5669 3.4205 5.8605 1.1902 6.6561 3.1582 4.8975 4.0586 1.7817 4.7642 1.3423 7.0723 6.1507 6.5088 1.3124 1.1719 5.1229 4.2293 4.4001 3.9867 2.6283 3.7297 1.8300 1.5944 3.0722 3.1068 1.1221 1.1671 1.0819 1.3625 1.5523 1.0880 1.6260 1.3073 1.6236 1.7582 1.7065 1.0990 1.0988 1.1429 1.1040 2.1673 6.7535 8.3785 1.0565 1.0605 1.0595 1.0594 1.1087 1.0994 1.1074 1.1037 1.0640 1.0783 1.0798
irintensity: 0.2211 55.0956 0.0204 1.8366 1.0605 0.6925 25.3434 6.7647 212.9548 1.1713 0.0326 10.7163 43.3156 34.7226 8.5599 132.9124 6.4785 2.8315 11.7154 9.6114 0.7649 2.1726 12.8121 11.6065 120.8140 197.1278 13.1280 3.9461 0.1895 22.3691 20.5232 1.1851 0.2176 0.0013 7.8582 1.9500 0.2887 63.3402 2.1764 81.5672 75.5495 9.0427 44.1358 0.9549 52.6266 7.6954 247.4362 357.5945 238.8617 74.1607 21.1504 117.1819 19.1925 13.2513 0.1116 75.6585 34.2951 24.1042 22.9656 13.7528
temp: 298.150 k
press: 1.00000 atm
elementType: 8 8 7 7 7 6 6 6 6 6 6 1 1 1 1 1 1 1 1 1 1 1
symmnumber: 1
zpe: 463262.0 jmol-1
zpe.correction: 0.176447 hartree
zpe.thermalcorrener: 0.187417 hartree
zpe.thermalcorrenthalpy: 0.188361 hartree
zpe.thermalcorrgfe: 0.136652 hartree
zpe.sumelectzpe: -549.068891 hartree
zpe.sumelectthermal: -549.057921 hartree
zpe.sumelectthermalent: -549.056977 hartree
zpe.sumelectthermalfe: -549.108686 hartree
dipole: -0.3761 -4.9492 -0.0340
dipole: 4.9635
quadrupole: -49.6813 -67.6360 -65.8157
quadrupole: 1.6958 0.2238 0.4954
quadrupole: 11.3630 -6.5916 -4.7714 1.6958 0.2238 0.4954
hfenergy: -549.2453383 hartree
pointgroup: C01 [X(C6H11N3O2)]
dipole: 0.1289284 1.9484703 -0.0174072 debye
dipolederiv: -1.1650514 0.4994467 0.0319738 0.4325118 -0.5170449 -0.0121486 0.0349073 -0.0136041 -0.4355374 -0.7021237 -0.1103693 0.0008903 0.1190455 -0.9445858 -0.0295945 0.0140103 -0.0234528 -0.2989459 -1.0096651 -0.3174923 0.0041294 -0.0696975 -0.5846954 0.0004154 -0.0036175 -0.0035219 -0.5446151 -1.5048544 0.190157 -0.0138818 0.3116387 -0.4261719 -0.0097115 0.0035065 -0.0145258 -0.5036534 -0.7717693 0.0980635 -0.0053294 0.3857598 -0.9653912 0.0169974 -0.0119816 0.0143603 -0.4002232 0.4520592 -0.0507223 -0.000153 -0.3149882 -0.0609412 0.0085768 0.0056755 0.0103833 0.3804372 0.4494523 -0.2139713 0.0069285 -0.1074341 0.2786958 -0.0017621 0.0039886 -0.0030263 0.2925247 1.8913839 0.0471266 0.0137041 -0.3636262 1.2970163 -0.0260846 0.0293643 -0.021385 0.2012613 0.6310142 0.1331874 0.00596 0.3272013 0.2221027 0.012787 -0.0080071 0.0103465 0.3252718 -0.2628722 -0.1279625 0.0038239 -0.3022549 -0.1220768 -0.0073805 0.002483 -0.0097806 0.1648728 1.654296 -0.1794538 -0.0345954 -0.2408597 1.3260386 0.050973 -0.0481193 0.047963 0.1933157 -0.1199266 -0.0375512 -0.0996604 -0.0319969 0.0592589 -0.0527478 -0.1761429 -0.0630087 -0.1003762 -0.1240385 -0.033456 0.1013177 -0.0232236 0.0638704 0.0442823 0.1782964 0.0545473 -0.1030271 -0.0508986 0.1026257 0.0583172 0.0455168 -0.0252678 -0.0892881 0.1302623 -0.1414128 -0.0677406 -0.0481884 0.0965508 -0.0626381 0.0363874 -0.0136904 0.0875679 -0.132611 0.1418146 -0.0853234 0.0095031 0.0007933 0.0062599 -0.0747043 0.0098556 -0.0786525 -0.0391792 -0.0749489 -0.057581 0.0249229 0.0038282 -0.0101544 -0.0690973 0.0110604 0.0739316 0.0330594 0.070297 -0.0492448 0.1191665 0.0184749 -0.0028895 0.0195455 0.0635853 0.0074249 -0.0028305 0.0078151 0.3922655 0.131911 0.0018851 -0.0027493 -0.0421065 0.1040954 0.0086754 -0.0101921 0.0148418 0.3260661 0.0715247 -0.0125452 -0.0100572 0.0553649 0.0261106 0.0881308 -0.0253721 0.1053702 -0.0104247 0.0738413 -0.0113174 0.0098472 0.0554957 0.0348836 -0.0860307 0.0248436 -0.1017133 -0.0138571 0.250313 -0.0972979 -0.0010438 -0.1484784 0.163292 -0.0063614 -0.002344 -0.0073589 0.3945346 unknown
polarizability: 124.6657308|-3.4839455|91.9821772|0.1920125|-0.0557303|56.769596 unknown
InChI: InChI=1S/C6H11N3O2/c10-5(11)1-2-7-6-8-3-4-9-6/h7-8,10H,1-4H2
charge 0 multiplicity 1
22 atoms
O  -4.498223 0.615955 0.050845
O  -3.385657 -1.420126 -0.054537
N  2.739314 1.165552 -0.01456
N  0.350997 0.792897 -0.029848
N  1.928409 -1.000395 0.024939
C  3.99104 0.383172 0.012354
C  3.423461 -1.094292 0.045561
C  1.639839 0.289169 -0.006734
C  -0.80035 -0.120589 -0.026433
C  -2.099198 0.7008 -0.000387
C  -3.336985 -0.1733 -0.006064
H  4.599714 0.614712 0.908121
H  4.610485 0.570375 -0.886501
H  3.774031 -1.676586 -0.826823
H  3.752852 -1.628067 0.956532
H  -0.772804 -0.777879 -0.915597
H  -0.745052 -0.792518 0.849708
H  2.703788 2.181087 -0.03706
H  0.198862 1.79776 -0.069552
H  -2.161995 1.376696 -0.876738
H  -2.145315 1.349241 0.896532
H  -5.296515 0.020636 0.043441
