program: Gaussian 09
title: 000152749
version: EM64L-G09RevD.01
frameworkgroup: C1[X(C13H9N3)]
method: RPBEPBE
basis: SDD
operation: Freq
keyword: #pfreq=noraman
keyword: PBEPBE/SDD
title: #p freq=noraman PBEPBE/SDD
converged: YES YES NO NO
title: Mulliken charges:
elementType: N N N C C C C C C C C C C C C C H H H H H H H H H
charge: -0.060864 0.001775 0.003189 0.415671 -0.090788 0.086451 -0.316525 -0.298951 0.286778 -0.385824 -0.319566 -0.245740 -0.219598 -0.369862 -0.354264 -0.375208 0.246739 0.231517 0.238263 0.266465 0.234262 0.236407 0.243580 0.292151 0.253944
chargesum: 0.00000
title: Mulliken charges with hydrogens summed into heavy atoms:
elementType: N N N C C C C C C C C C C C C C
charge: -0.060864 0.001775 0.003189 0.415671 -0.090788 0.086451 -0.069787 -0.067434 0.286778 -0.147560 -0.053101 -0.011478 0.016809 -0.126282 -0.062113 -0.121264
polarizability: 2.93314628e+02 8.97984737e+00 1.57739504e+02 1.48400919e-01 4.39876067e-01 6.19048886e+01
1716.lowfreq: -6.7613 -0.0009 -0.0007 -0.0005 2.1539 7.6257 23.4703 60.6450 108.8415
frequency: 23.1487 60.6405 108.8375 157.5395 171.9697 260.7779 278.1636 316.5919 384.7264 393.8389 432.6136 475.5659 481.0205 518.6617 556.7236 564.1656 609.8823 622.3286 689.5210 721.4688 734.1753 755.8957 767.2618 799.3592 841.8932 850.1197 887.4502 899.9746 920.7871 946.2431 966.5970 975.6629 987.4312 989.7109 999.9519 1016.4134 1042.7672 1105.2499 1125.2545 1145.6954 1158.5793 1169.0543 1226.9403 1239.1200 1252.6321 1290.4644 1303.3441 1332.5914 1355.9938 1394.7183 1401.7628 1409.6614 1426.2550 1458.6064 1502.3012 1507.6463 1544.8840 1553.0788 1592.7458 1624.7486 3124.9539 3131.3606 3135.0336 3140.3802 3157.8600 3165.6555 3168.5146 3170.4710 3172.4880
redmass: 5.1059 5.5039 5.4478 4.0136 4.1420 4.1820 7.0797 5.0410 3.9707 3.6993 4.0944 4.1415 3.2155 7.1772 3.7436 7.5253 8.5243 7.7745 2.9358 8.5422 2.0347 5.6516 1.3541 3.1984 1.4763 6.7116 1.6762 1.9148 5.3960 1.4436 1.3541 1.5348 1.3971 5.1579 1.3378 2.2076 4.1453 2.6382 1.9699 2.2782 1.3023 1.1217 9.3251 1.9689 1.6927 2.4870 2.1525 1.7138 2.5773 2.4053 1.7065 5.7803 2.1563 3.1931 4.2540 4.4620 5.9619 5.2640 6.3553 6.5792 1.0875 1.0904 1.0907 1.0892 1.0949 1.0906 1.0956 1.0957 1.0997
irintensity: 0.3878 0.1495 0.2403 0.3023 5.6363 0.0528 0.0397 2.6630 0.6877 1.7912 0.7941 5.7544 8.9098 0.3404 0.3709 0.8900 10.5242 0.3009 0.3281 0.2640 29.4972 3.7200 44.8689 1.6381 86.8305 1.9836 3.9950 11.6728 5.0200 2.0845 2.2571 2.6205 3.2124 8.0400 0.0746 6.4147 1.0386 5.0965 11.3442 14.8103 2.8762 1.9229 0.1094 3.3844 6.4983 13.0488 18.8701 8.1321 5.4091 88.7059 5.7067 5.8354 10.8674 4.3415 13.8810 40.9404 22.7859 4.9761 26.1085 5.1764 3.4640 25.0369 0.7211 10.3238 22.5859 11.3829 14.7355 7.7260 20.1619
temp: 298.150 k
press: 1.00000 atm
elementType: 7 7 7 6 6 6 6 6 6 6 6 6 6 6 6 6 1 1 1 1 1 1 1 1 1
symmnumber: 1
zpe: 494643.4 jmol-1
zpe.correction: 0.188400 hartree
zpe.thermalcorrener: 0.199920 hartree
zpe.thermalcorrenthalpy: 0.200865 hartree
zpe.thermalcorrgfe: 0.149395 hartree
zpe.sumelectzpe: -663.956152 hartree
zpe.sumelectthermal: -663.944631 hartree
zpe.sumelectthermalent: -663.943687 hartree
zpe.sumelectthermalfe: -663.995157 hartree
dipole: -4.8016 2.2597 -0.1832
dipole: 5.3099
quadrupole: -90.8779 -86.3325 -96.4736
quadrupole: 1.3144 -0.2793 -1.2026
quadrupole: 0.3501 4.8955 -5.2456 1.3144 -0.2793 -1.2026
hfenergy: -664.1445518 hartree
pointgroup: C01 [X(C13H9N3)]
dipole: 1.887446 0.8917834 0.0810255 debye
dipolederiv: -0.4587297 0.0362689 0.0058554 0.0307808 -0.3256001 -0.0113018 0.0584367 -0.0128981 -0.2371973 -0.5885895 -0.0420103 0.0009446 -0.2337963 -0.424656 0.0341256 0.0159022 0.0362542 -0.2157941 -0.6118715 -0.0056971 -0.0156721 0.0936991 -0.3345676 0.0290585 -0.0125438 0.0255092 -0.2186346 -0.0510741 -0.1154743 -0.0095434 0.2103045 -0.2261167 -0.0250733 0.0178686 -0.0177496 0.0693684 0.1709952 -0.0692916 0.0001993 -0.3504839 0.1039521 0.0014942 -0.0514698 0.0056394 0.0743236 0.6577111 0.0963045 -0.0021451 0.3894183 0.2414513 0.022321 0.0390129 0.0108097 0.0727886 0.269781 0.0740746 0.0028786 -0.0498159 0.2152349 0.0282733 0.004427 0.0312988 -0.1265145 -0.4588358 -0.1212199 -0.0188311 -0.274798 -0.0746426 0.0150411 -0.0605397 0.0067079 -0.1261609 0.1430386 0.0463566 -0.0058638 0.0342102 -0.3150653 0.0738577 -0.0324427 0.0792178 0.067441 0.0110689 0.0734749 0.0044345 0.1511181 0.0853988 0.016408 0.0121295 0.0178963 -0.1660017 -0.0943178 0.0901226 0.0058892 0.0134132 0.0712006 0.0191527 -0.0041345 0.0135918 -0.1576778 0.0793429 0.0723953 0.0054129 0.1199582 -0.0520366 0.0056827 0.0077301 0.0056819 -0.1471524 -0.082782 -0.1027447 -0.0066426 -0.1675045 0.122262 0.0193307 -0.0079621 0.0190606 -0.1467285 0.1953692 -0.0646583 0.0152281 0.0680199 0.319231 -0.0734888 -0.0266869 -0.076592 -0.0204687 0.1530417 0.0409599 0.0090247 -0.0897745 0.2715531 -0.0674448 0.0401517 -0.0408382 -0.0017841 0.518524 0.0455008 0.0135504 0.0885066 0.3279409 -0.054752 0.0030604 -0.0613556 0.0009892 0.0398548 -0.0897441 -0.0065919 -0.0486957 -0.0582882 -0.0168287 -0.0011095 -0.0192902 0.1426724 0.0258994 0.1155481 0.0131036 0.1029728 0.00468 -0.0169553 0.0154045 -0.0112368 0.1539842 0.0337076 -0.0297508 -0.0024129 -0.1151225 -0.0776303 -0.0169036 -0.0087806 -0.0166571 0.1579203 0.0797256 -0.0825492 -0.004867 -0.0215267 -0.0198121 -0.0138435 -0.0035548 -0.0114244 0.1595513 -0.1339851 -0.0196914 -0.0009926 -0.0184228 0.0908658 -0.0051984 -0.0014323 -0.0046983 0.1613857 -0.0028122 0.0999159 0.0074877 0.1130844 -0.0416675 -0.0143728 0.0087645 -0.0136069 0.1588647 0.0996085 -0.0811361 0.0121734 -0.1025885 -0.0561713 0.0301765 0.0450123 0.0240684 0.1048276 0.0925427 0.0683141 -0.0205576 0.0960944 0.0680255 0.0153417 -0.0508269 0.0023907 0.1120275 -0.0872136 -0.0352683 -0.0020624 -0.0390511 0.0844584 0.0058991 -0.0064168 0.0082205 0.1279701 unknown
polarizability: 293.3426081|-8.7551615|157.7119533|0.6006954|0.0651852|61.9044598 unknown
InChI: InChI=1S/C13H9N3/c1-2-4-12-10(3-1)5-6-13(16-12)11-7-14-9-15-8-11/h1-9H
charge 0 multiplicity 1
25 atoms
N  0.328447 -0.70146 -0.048315
N  -4.284337 0.803728 -0.227083
N  -3.769215 -1.544111 0.188439
C  2.28787 0.82238 0.061358
C  1.69793 -0.499334 -0.031375
C  -0.493038 0.373812 0.027527
C  1.389155 1.93484 0.147553
C  0.013353 1.718532 0.133871
C  -1.953553 0.090811 0.005009
C  3.712471 0.956301 0.069573
C  2.556699 -1.642763 -0.113303
C  4.526754 -0.176477 -0.011493
C  3.944353 -1.482323 -0.103055
C  -2.946186 1.08246 -0.216311
C  -2.440918 -1.233503 0.200382
C  -4.629737 -0.500816 -0.020226
H  1.792898 2.950466 0.231139
H  -0.675655 2.563199 0.220636
H  4.155383 1.956969 0.140596
H  2.088205 -2.62902 -0.184189
H  5.617044 -0.071645 -0.005711
H  4.597483 -2.359418 -0.166076
H  -2.685435 2.129097 -0.408391
H  -1.73285 -2.050564 0.364879
H  -5.698222 -0.73546 -0.024237
