program: Gaussian 09
title: 000013657
version: EM64L-G09RevD.01
frameworkgroup: C1[X(C8H10N2O2)]
method: RPBEPBE
basis: SDD
operation: Freq
keyword: #p
keyword: freq=noraman
keyword: PBEPBE/SDD
title: #p freq=noraman PBEPBE/SDD
converged: NO NO NO NO
title: Mulliken charges:
elementType: O O N N C C C C C C C C H H H H H H H H H H
charge: -0.259566 -0.280639 -0.154004 0.046730 0.412439 -0.341330 -0.329743 0.326640 -0.354499 -0.334073 -0.678422 -0.536926 0.241179 0.284309 0.242703 0.255267 0.244203 0.279819 0.244204 0.221680 0.221678 0.248351
chargesum: 0.00000
title: Mulliken charges with hydrogens summed into heavy atoms:
elementType: O O N N C C C C C C C C
charge: -0.259566 -0.280639 -0.154004 0.046730 0.412439 -0.100151 -0.045434 0.326640 -0.111797 -0.078806 0.089804 0.154783
polarizability: 2.02006690e+02 -8.46131177e+00 1.06807376e+02 -3.71742713e-03 -5.86627899e-03 5.28901825e+01
1716.lowfreq: -13.8949 -8.2776 -7.3397 -0.0008 -0.0007 -0.0001 21.2626 64.4340 117.7207
frequency: 21.1533 64.3618 117.7062 149.8490 191.8404 199.0459 235.1947 241.8734 320.4617 341.5325 382.1223 409.2409 415.1136 421.7912 494.5499 526.8952 595.2379 628.8659 723.8488 757.6682 799.1908 799.6701 843.0521 867.7013 922.4632 981.9361 986.1085 994.8221 1050.4068 1103.0503 1111.3934 1115.8915 1156.0654 1167.8760 1185.4997 1234.3986 1295.2509 1307.4779 1347.4482 1390.1079 1407.6052 1435.2003 1436.8559 1465.2214 1471.3019 1474.0303 1486.8292 1501.0098 1582.7635 1626.3755 2957.3953 2987.9252 3043.8603 3082.8277 3098.7943 3128.8475 3153.8754 3163.8963 3174.4494 3195.8603
redmass: 3.8605 3.4915 4.4366 4.9041 1.6523 1.2504 4.1787 1.6415 4.3195 6.2734 4.7004 5.1293 3.2344 5.0807 3.9254 2.4266 6.0179 7.0148 3.7363 5.1748 6.0625 1.3352 1.5462 3.6355 1.3669 1.3315 8.1642 2.9883 4.5906 1.3213 1.2616 1.4010 1.3405 1.5787 1.3874 2.8472 2.8912 1.5749 6.2427 5.2530 1.2986 1.5004 2.1782 1.0500 1.0708 1.0928 1.0484 2.5559 7.3942 6.4043 1.0334 1.0317 1.1038 1.1025 1.0998 1.0990 1.0869 1.0901 1.0955 1.0955
irintensity: 2.0559 1.7819 5.6382 0.8686 1.2063 0.2247 12.1048 0.5529 1.7150 1.3741 6.0683 0.3334 0.0158 0.2401 3.0653 21.1806 23.2753 0.0249 0.0306 0.7449 43.6181 26.9519 68.9138 129.1486 0.2910 0.4256 59.3557 41.1506 85.4853 0.0061 0.1777 11.0645 5.5867 4.2087 150.5918 118.6447 139.2656 0.4248 107.9646 47.5586 51.9702 15.0638 2.7296 14.1105 89.6887 2.1649 22.3460 165.9436 17.7369 44.4540 73.5803 23.6963 49.4639 19.8763 3.0397 24.3644 12.7923 4.0764 9.2464 0.8726
temp: 298.150 k
press: 1.00000 atm
elementType: 8 8 7 7 6 6 6 6 6 6 6 6 1 1 1 1 1 1 1 1 1 1
symmnumber: 1
zpe: 447242.4 jmol-1
zpe.correction: 0.170346 hartree
zpe.thermalcorrener: 0.181996 hartree
zpe.thermalcorrenthalpy: 0.182940 hartree
zpe.thermalcorrgfe: 0.131860 hartree
zpe.sumelectzpe: -569.826762 hartree
zpe.sumelectthermal: -569.815112 hartree
zpe.sumelectthermalent: -569.814168 hartree
zpe.sumelectthermalfe: -569.865248 hartree
dipole: -4.1523 4.2291 0.0011
dipole: 5.9268
quadrupole: -75.5535 -64.4808 -72.7051
quadrupole: 3.2441 0.0087 -0.0037
quadrupole: -4.6404 6.4323 -1.7920 3.2441 0.0087 -0.0037
hfenergy: -569.997108 hartree
pointgroup: C01[X(C8H10N2O2)]
dipole: 1.6461048 1.6515051 -0.0004333 debye
dipolederiv: -1.9951067 -0.1364151 -0.000084 0.0237777 -0.3174118 -0.0000106 -0.0000249 -0.0000135 -0.295456 -1.7994207 -0.5267103 0.0003174 0.2815561 -0.2075467 -0.0000003 -0.0001687 0.0000099 -0.215358 -0.6893176 -0.0710468 0.0000267 -0.8235066 -0.4347442 0.0001144 0.0006043 0.000186 -0.0842054 1.6724227 0.7704491 -0.0004547 0.6394185 0.3325348 -0.0002347 -0.0001837 -0.0001642 -0.0727197 0.6879948 -0.1118724 0.0000152 0.0071422 -0.1594405 0.0000995 -0.0002777 0.0000254 0.0418593 0.1066916 0.1356321 0.000043 -0.0994875 0.0724442 0.0000549 -0.0000148 0.0001074 -0.1728914 0.0507205 -0.0455725 -0.000029 0.0340787 0.0480274 0.0000857 -0.0000192 0.0000299 -0.1392123 1.6578535 -0.041859 0.0000194 -0.3777469 -0.0111439 -0.0000585 -0.0000761 -0.0000388 0.094016 -0.3459132 -0.0698032 -0.0000229 0.4662906 -0.0155924 0.0000627 0.0001809 0.000049 -0.203668 -0.3957911 0.0401262 0.0000305 -0.2874779 0.1028137 0.000102 -0.0001031 0.0000797 -0.1623252 -0.0546011 -0.1357698 0.0000575 -0.0517726 0.1276559 0.0001204 -0.0001999 0.0000483 0.2270596 0.7511951 0.1437406 0.0000552 0.550091 0.3620648 0.0000222 0.0001866 0.0000152 0.3301302 0.0696779 0.0733364 0.000029 0.0847483 -0.0550445 -0.0000707 0.0000355 -0.0000831 0.1600275 0.0780353 -0.07448 -0.0000481 -0.0433896 0.0474115 -0.000057 -0.0000526 -0.0000389 0.1667002 0.0015819 -0.0895287 -0.0000327 -0.1089757 -0.0082939 -0.0000597 -0.0000307 -0.0000481 0.1672616 0.0615995 0.0636971 0.0000177 0.0642959 -0.0245773 -0.0000618 0.0000058 -0.0000613 0.166013 0.1158739 -0.0505458 -0.0908792 -0.0039028 -0.0105816 -0.0495737 -0.0556656 -0.0759711 -0.0450871 -0.0280007 0.0850714 -0.0001599 -0.1205596 0.171737 -0.0000954 -0.0000002 -0.0000179 0.1381063 0.1158077 -0.0506152 0.0910633 -0.00395 -0.0104471 0.0495468 0.0558808 0.075862 -0.0449607 0.0422273 0.024006 0.0599067 -0.1611909 -0.036962 -0.1098282 -0.0188976 -0.1112617 -0.0901716 0.0422363 0.0240313 -0.0598725 -0.1612194 -0.0371107 0.109857 0.0188082 0.1113015 -0.0900348 -0.1457668 0.0441285 0.0000012 0.0917806 0.0642074 -0.0000147 0.0000126 -0.0000157 0.1249167 unknown
polarizability: 202.1286397|7.7439936|106.6854268|-0.0036732|0.0058941|52.8901825 unknown
InChI: InChI=1S/C8H10N2O2/c1-10(9-11)7-3-5-8(12-2)6-4-7/h3-6H,1-2H3
charge 0 multiplicity 1
22 atoms
O  3.463902 -0.571435 -0.000099
O  -4.193565 -0.591005 0.000521
N  -2.129408 0.343923 -0.000025
N  -2.928143 -0.814062 0.000576
C  -0.712911 0.135773 -0.00003
C  0.168268 1.243353 0.000349
C  -0.170012 -1.183129 -0.00042
C  2.098694 -0.25624 -0.00004
C  1.568469 1.054373 0.000337
C  1.217173 -1.370163 -0.000417
C  -2.731272 1.68777 -0.00063
C  4.414637 0.54226 0.000331
H  -0.220525 2.265637 0.000697
H  -0.843934 -2.041691 -0.000723
H  2.222518 1.931009 0.000635
H  1.646554 -2.376408 -0.000727
H  -2.432852 2.250278 0.901184
H  -3.824524 1.542629 -0.001202
H  -2.431744 2.249866 -0.902318
H  4.298206 1.170942 0.904969
H  4.298322 1.171543 -0.903904
H  5.409044 0.073375 0.00024
