program: Gaussian 09
title: 000013654
version: EM64L-G09RevD.01
frameworkgroup: C1[X(C10H12O2)]
method: RPBEPBE
basis: SDD
operation: Freq
keyword: #pfreq=noraman
keyword: PBEPBE/SDD
title: #p freq=noraman PBEPBE/SDD
converged: YES YES NO NO
title: Mulliken charges:
elementType: O O C C C C C C C C C C H H H H H H H H H H H H
charge: -0.298933 -0.264701 0.043148 -0.686922 -0.683803 0.215486 0.202479 -0.343519 -0.340014 -0.219819 -0.217839 -0.223419 0.233162 0.209425 0.233334 0.221140 0.212335 0.254717 0.219269 0.270217 0.269630 0.232676 0.230276 0.231676
chargesum: 0.00000
title: Mulliken charges with hydrogens summed into heavy atoms:
elementType: O O C C C C C C C C C C
charge: -0.298933 -0.264701 0.276310 -0.023022 0.002519 0.215486 0.202479 -0.073303 -0.070384 0.012857 0.012436 0.008257
polarizability: 1.62571943e+02 -1.85022903e+00 1.14844615e+02 -1.98201180e+00 5.12992576e+00 6.39274802e+01
1716.lowfreq: -12.2405 0.0006 0.0009 0.0009 4.3883 6.1197 38.8483 57.1201 87.8803
frequency: 38.7335 57.1145 87.8792 107.0577 171.5214 190.9631 224.2129 251.9085 277.5556 360.9740 396.9031 404.2691 426.6919 453.5129 490.7314 614.1582 657.4355 680.5487 701.9664 780.9939 795.5346 807.0521 865.0134 903.0278 927.1818 941.9995 954.2302 990.4471 996.0846 1007.9065 1019.8273 1056.6620 1086.2161 1104.3443 1157.9081 1173.2236 1177.9075 1184.6175 1243.2007 1313.5150 1327.5485 1335.7041 1380.6693 1389.4544 1395.7472 1437.3378 1456.6315 1465.0854 1472.8160 1477.3406 1487.7859 1582.6321 1610.6477 1615.7006 2988.5106 2991.8019 3026.8712 3083.3652 3092.1319 3097.5749 3103.9671 3128.8310 3141.5559 3154.3503 3166.3966 3178.4207
redmass: 3.0083 3.8828 5.6441 3.7812 4.5260 1.0326 1.3494 2.6047 3.3020 3.9965 3.1882 2.8304 3.2580 3.9693 3.5728 6.4418 6.8833 5.0474 1.5892 4.0420 2.2186 6.1895 1.2444 2.5993 1.2310 1.3633 1.4222 6.2356 1.3843 1.3274 2.8255 2.8722 1.7732 1.7184 2.0448 1.0570 1.4012 1.4623 3.1276 1.3286 1.5392 1.3345 1.2589 9.9316 1.2324 2.2416 1.0533 1.0478 1.0585 2.2403 1.0517 7.1090 6.4171 9.0412 1.0356 1.0359 1.0864 1.0994 1.0986 1.1005 1.1007 1.0854 1.0892 1.0939 1.0979 1.0975
irintensity: 0.0086 2.9340 0.1893 1.6499 0.2442 0.0166 1.9335 6.5052 1.3356 3.6007 5.6082 0.0094 4.0798 0.9753 0.3065 0.5521 4.3984 13.6724 94.8875 5.4857 21.9788 10.0439 0.0466 15.0537 2.5372 0.2892 4.2048 1.2655 0.0181 0.4495 82.0104 235.0898 48.2270 54.8815 12.3848 0.1522 79.0940 2.9170 309.2145 2.7687 10.5235 3.0052 34.6723 3.1083 17.4303 14.8649 6.9943 6.5099 4.2671 8.5961 20.6511 54.7614 15.3057 132.9214 15.6361 25.2517 6.4767 4.2072 59.4804 22.7140 27.4303 0.2486 12.1892 16.5272 21.5386 8.3519
temp: 298.150 k
press: 1.00000 atm
elementType: 8 8 6 6 6 6 6 6 6 6 6 6 1 1 1 1 1 1 1 1 1 1 1 1
symmnumber: 1
zpe: 512419.8 jmol-1
zpe.correction: 0.195170 hartree
zpe.thermalcorrener: 0.206964 hartree
zpe.thermalcorrenthalpy: 0.207908 hartree
zpe.thermalcorrgfe: 0.156593 hartree
zpe.sumelectzpe: -537.835237 hartree
zpe.sumelectthermal: -537.823444 hartree
zpe.sumelectthermalent: -537.822499 hartree
zpe.sumelectthermalfe: -537.873815 hartree
dipole: -0.0009 1.9772 0.3732
dipole: 2.0121
quadrupole: -54.2840 -71.9094 -73.5639
quadrupole: 1.7546 -0.3358 -0.1193
quadrupole: 12.3017 -5.3236 -6.9781 1.7546 -0.3358 -0.1193
hfenergy: -538.0304075 hartree
pointgroup: C01 [X(C10H12O2)]
dipole: -0.0164003 0.7404706 0.2794921 debye
dipolederiv: -1.7450395 -0.3396436 -0.1383648 -0.6266699 -0.6680775 -0.0778368 -0.1492444 -0.049762 -0.34297 -0.8252643 0.196088 0.0657097 0.0173411 -0.8608941 -0.1906089 0.008783 -0.1846952 -0.3895899 1.1269665 0.1511115 0.0756728 -0.001003 0.2989321 -0.0776338 -0.0274538 -0.1193391 0.3673863 -0.0749482 -0.0667237 -0.0138806 -0.0581647 -0.0727754 0.0690632 0.015017 0.0740115 0.0383929 -0.1258511 -0.0396593 -0.0384989 0.0214849 -0.0409328 0.1013963 -0.0233042 0.1297544 -0.0845594 -0.5984047 0.0985944 0.0436287 0.0956836 -0.0767108 -0.0224849 0.0408669 -0.025937 -0.0216174 2.1137012 -0.0283735 -0.0164127 0.4790094 1.1544086 0.3308665 0.1116724 0.3052014 0.3292859 0.0518835 -0.125934 -0.0448162 0.1080619 0.0161922 0.0401322 0.0281709 0.0441946 -0.0984559 0.0790589 0.0799228 0.0160092 -0.1091807 -0.0217041 0.0315772 -0.0385514 0.0249431 -0.1047074 -0.0216595 0.178348 0.0502455 0.1862385 -0.045015 0.0323195 0.0556214 0.0310995 -0.1498215 -0.2051205 -0.0884295 -0.0271105 -0.1078341 0.103808 0.0859824 -0.0328211 0.0871761 -0.1286589 0.1173711 -0.0270546 -0.018895 -0.0224348 0.0158915 0.0502299 -0.0159487 0.0506077 -0.1230474 -0.0281897 -0.031384 -0.0254538 0.0658286 -0.0000515 -0.0743652 0.0281131 -0.0437153 -0.0652216 -0.183653 0.0046493 0.0300394 0.0304639 0.0696701 -0.0103977 0.0202178 -0.004421 0.1078149 0.1000894 0.0473579 -0.0831593 0.0156201 0.0220246 0.089739 -0.0672329 0.0951645 -0.0746795 0.10989 0.0350725 0.0454547 -0.0146107 -0.0021089 -0.0760259 0.0178942 -0.130818 -0.0563599 -0.1944967 0.0456096 -0.0008692 0.0535279 0.1127297 0.004428 -0.0102757 -0.0091002 0.0773242 0.0918456 -0.1042051 0.0307302 -0.0916953 -0.0589211 0.0537588 0.0319667 0.021344 0.0721886 0.1108451 0.0434846 0.0362224 0.0178324 -0.0026371 -0.1294239 0.0033164 -0.065237 -0.0580798 0.1299815 0.0497727 0.0179633 0.0160895 0.002498 -0.0488504 0.0063799 -0.0498484 0.1390275 0.0696588 -0.0795464 -0.0214521 -0.0879526 0.047104 -0.0321209 -0.0260151 -0.0309661 0.1413379 -0.0395781 -0.0933115 -0.0242482 -0.1070476 0.002615 -0.046905 -0.0276817 -0.0469306 0.1448381 0.0578345 0.0435356 0.0166525 0.0668355 -0.0828676 -0.0784946 0.0244454 -0.0782758 0.1314266 -0.1169209 0.0507183 0.0248328 0.0525763 0.086822 -0.0243449 0.0260638 -0.0244511 0.1487457 unknown
polarizability: 162.6577608|-0.8299626|111.5192718|-1.1602981|13.4797741|67.1670052 unknown
InChI: InChI=1S/C10H12O2/c1-8(2)12-10(11)9-6-4-3-5-7-9/h3-8H,1-2H3
charge 0 multiplicity 1
24 atoms
O  1.476382 0.3982 0.022996
O  0.953136 -1.780261 -0.637831
C  2.946511 0.085013 -0.106898
C  3.623481 1.429644 -0.379086
C  3.420243 -0.606214 1.17978
C  -0.838991 -0.217501 -0.085157
C  0.583665 -0.636448 -0.265306
C  -1.853024 -1.172503 -0.356883
C  -1.193258 1.087879 0.344527
C  -3.21048 -0.825025 -0.200739
C  -2.553155 1.430887 0.499984
C  -3.563213 0.477203 0.228122
H  3.053447 -0.603818 -0.965618
H  4.710135 1.281525 -0.515646
H  3.217253 1.896718 -1.292471
H  3.470386 2.123109 0.466719
H  4.504256 -0.814839 1.117258
H  2.894199 -1.564419 1.32606
H  3.240626 0.040801 2.056814
H  -1.554534 -2.173246 -0.686486
H  -0.402447 1.814601 0.549825
H  -3.991483 -1.563565 -0.41161
H  -2.826895 2.438359 0.831925
H  -4.618442 0.746901 0.349718
