program: Gaussian 09
title: 000152672
version: EM64L-G09RevD.01
frameworkgroup: C1[X(C12H16N4O)]
method: RPBEPBE
basis: SDD
operation: Freq
keyword: #p
keyword: freq=noraman
keyword: PBEPBE/SDD
title: #p freq=noraman PBEPBE/SDD
converged: YES YES NO NO
title: Mulliken charges:
elementType: O N N N N C C C C C C C C C C C C H H H H H H H H H H H H H H H H
charge: -0.328888 -0.403020 -0.465631 -0.427774 -0.110610 -0.328923 -0.381512 -0.352395 0.310900 0.037440 0.142955 -0.683297 0.312160 -0.363073 -0.341673 -0.215617 -0.234798 0.214870 0.197226 0.212424 0.263466 0.195773 0.186120 0.296431 0.372320 0.215435 0.218524 0.211562 0.328706 0.234183 0.244074 0.220801 0.221842
chargesum: 0.00000
title: Mulliken charges with hydrogens summed into heavy atoms:
elementType: O N N N N C C C C C C C C C C C C
charge: -0.328888 -0.106589 -0.093312 -0.099068 -0.110610 0.083173 0.094378 0.029498 0.310900 0.037440 0.142955 -0.037776 0.312160 -0.128890 -0.097599 0.005184 -0.012956
polarizability: 2.75769900e+02 2.26629545e+00 1.47641907e+02 -1.85090276e+01 1.05831380e+01 9.28960426e+01
1716.lowfreq: -0.0006 -0.0003 0.0004 1.8449 3.1590 13.3252 16.9342 37.5730 55.1487
frequency: 15.4211 37.1406 55.1335 78.6974 90.7519 103.0020 121.7282 170.0102 215.9703 231.1641 253.2233 257.6558 267.2020 319.8777 334.3279 384.5959 419.9539 439.1750 473.8570 510.9326 549.1919 579.6095 608.3370 614.8383 684.6747 687.7121 700.9134 722.3924 750.1699 753.3653 762.7882 784.4260 819.4526 830.5557 852.2079 854.2657 880.7108 928.0969 930.1618 970.6870 970.9759 982.8946 1005.8079 1021.7447 1055.6673 1106.1488 1115.0656 1125.4690 1136.2256 1159.2421 1189.8967 1212.8445 1219.0100 1230.0095 1261.8986 1266.1204 1290.7576 1308.9762 1309.8075 1351.8069 1360.8226 1377.9386 1393.3953 1406.5776 1447.2247 1457.5323 1461.7600 1469.3608 1473.7442 1478.4732 1481.9249 1486.3087 1511.5800 1570.8267 1595.1436 1628.8334 1643.0431 2957.4397 2976.7265 2979.2553 2983.1099 3002.6151 3045.2070 3074.0913 3077.4421 3082.1131 3129.2406 3142.9958 3158.2980 3170.5018 3486.2162 3545.3410 3559.3137
redmass: 4.1915 4.6913 4.6715 1.9650 3.4669 4.5244 3.4088 4.4294 3.2039 1.3156 5.2740 3.0611 2.3711 5.2726 3.7433 2.4398 1.8454 2.4036 5.4855 2.6049 6.1520 3.5446 1.2413 6.6273 7.3476 4.1441 7.3468 2.0959 1.2798 1.6671 3.4095 1.2007 4.1471 1.9812 1.9300 1.4845 4.3845 1.7259 1.3834 2.5815 1.2980 2.3776 2.2460 3.3806 2.6352 1.8526 2.1425 2.3627 1.8451 1.1215 1.8131 1.7214 2.0452 1.3489 1.3923 2.5400 1.1078 1.9613 1.2613 1.4826 1.5312 2.8522 1.2104 2.8336 3.5932 1.0800 1.1042 3.2342 1.0718 1.0425 2.5380 1.0772 2.1475 5.1973 7.4226 5.0706 7.1314 1.0589 1.0393 1.0571 1.0680 1.0994 1.1016 1.1005 1.0996 1.0964 1.0851 1.0902 1.0959 1.0993 1.0827 1.0772 1.0771
irintensity: 0.0964 0.3468 2.1540 2.0449 6.5931 6.4744 1.7203 6.4588 5.7096 1.7774 4.0639 1.2358 0.1602 14.5427 0.5686 32.1193 21.3204 0.8934 9.9041 4.3825 0.8503 8.7256 206.9390 0.1671 0.1591 2.9682 6.4629 2.5797 64.4977 18.1076 14.0996 160.7880 0.6714 0.7353 5.1229 0.0751 11.8842 7.8916 5.3951 4.5493 0.0145 8.5993 17.7634 0.8939 2.7583 8.7195 3.1812 1.8395 6.3665 0.1117 34.6725 179.2428 48.3533 48.9600 33.2524 174.9458 0.7411 21.6823 41.5546 7.9923 14.3617 46.5774 8.9290 0.5086 58.0965 4.1942 38.9322 9.8692 9.4566 11.6822 52.9201 16.8447 585.0328 657.1131 47.0857 322.0140 72.4831 31.8484 20.8708 60.4773 50.2684 7.7288 55.8405 77.4312 44.0934 6.2806 1.2720 12.6469 26.8719 24.2134 200.4854 21.8788 44.0031
temp: 298.150 k
press: 1.00000 atm
elementType: 8 7 7 7 7 6 6 6 6 6 6 6 6 6 6 6 6 1 1 1 1 1 1 1 1 1 1 1 1 1 1 1 1
symmnumber: 1
zpe: 711653.3 jmol-1
zpe.correction: 0.271054 hartree
zpe.thermalcorrener: 0.287104 hartree
zpe.thermalcorrenthalpy: 0.288048 hartree
zpe.thermalcorrgfe: 0.225588 hartree
zpe.sumelectzpe: -759.897461 hartree
zpe.sumelectthermal: -759.881412 hartree
zpe.sumelectthermalent: -759.880467 hartree
zpe.sumelectthermalfe: -759.942928 hartree
dipole: 4.9539 -0.3446 -0.5637
dipole: 4.9977
quadrupole: -85.6449 -100.3116 -103.9292
quadrupole: -8.2107 -5.6816 2.7471
quadrupole: 10.9836 -3.6831 -7.3006 -8.2107 -5.6816 2.7471
hfenergy: -760.1685157 hartree
pointgroup: C01 [X(C12H16N4O1)]
dipole: -1.9501334 -0.1973829 0.1555058 debye
polarizability: 276.6721969|2.261691|148.7735472|-12.9881383|-7.4726873|90.8621051 unknown
InChI: InChI=1S/C12H16N4O/c1-2-3-8-13-12(17)16-11-14-9-6-4-5-7-10(9)15-11/h4-7,13-14,16H,2-3,8H2,1H3
charge 0 multiplicity 1
33 atoms
O  -1.214061 1.533173 0.262196
N  -2.789891 -0.136024 0.730133
N  1.374798 0.789164 0.040129
N  -0.517478 -0.693052 0.514538
N  1.760273 -1.455713 0.339595
C  -4.900953 0.564745 -0.466756
C  -3.94117 0.784858 0.724982
C  -5.602842 -0.813283 -0.467889
C  2.761611 0.617553 -0.111922
C  2.985451 -0.792771 0.078803
C  0.847484 -0.469509 0.304086
C  -6.611133 -0.962964 -1.62786
C  -1.502109 0.310743 0.488112
C  3.808238 1.518691 -0.385795
C  4.295107 -1.314584 -0.006983
C  5.110865 0.97592 -0.467382
C  5.34944 -0.416253 -0.281199
H  -4.341291 0.702772 -1.41241
H  -5.671313 1.361839 -0.432219
H  -4.494032 0.673721 1.67935
H  -3.518709 1.80326 0.692901
H  -6.126963 -0.957581 0.499711
H  -4.845385 -1.621102 -0.543752
H  -2.96735 -1.128747 0.887075
H  0.780345 1.623651 -0.011369
H  -6.108213 -0.850481 -2.606396
H  -7.10348 -1.952222 -1.611791
H  -7.400246 -0.190447 -1.565699
H  -0.747978 -1.6705 0.703742
H  3.631048 2.589544 -0.529507
H  4.474712 -2.384303 0.13683
H  5.95586 1.640697 -0.678382
H  6.374964 -0.795194 -0.352872
