program: Gaussian 09
title: 000152582
version: EM64L-G09RevD.01
frameworkgroup: C1[X(C21H16N2O2)]
method: RPBEPBE
basis: SDD
operation: Freq
keyword: #p
keyword: freq=noraman
keyword: PBEPBE/SDD
title: #p freq=noraman PBEPBE/SDD
converged: NO YES NO NO
title: Mulliken charges:
elementType: O O N N C C C C C C C C C C C C C C C C C C C C C H H H H H H H H H H H H H H H H
charge: -0.393909 -0.270199 -0.518241 -0.042489 0.249619 0.223237 0.218796 -0.095810 -0.110214 0.220555 0.300244 -0.374553 -0.330312 -0.312706 -0.313081 -0.665563 -0.310750 -0.383325 -0.277143 -0.270937 -0.235854 -0.239658 -0.236788 -0.257870 0.245598 0.352123 0.245974 0.263325 0.264267 0.264222 0.265803 0.255905 0.272308 0.236045 0.227648 0.228099 0.230040 0.230190 0.231036 0.230439 0.383931
chargesum: 0.00000
title: Mulliken charges with hydrogens summed into heavy atoms:
elementType: O O N N C C C C C C C C C C C C C C C C C C C C C
charge: -0.009978 -0.270199 -0.166118 -0.042489 0.249619 0.223237 0.218796 -0.095810 -0.110214 0.220555 0.300244 -0.128578 -0.066987 -0.048439 -0.048859 -0.143855 -0.038442 -0.147281 -0.049495 -0.042838 -0.005815 -0.009468 -0.005753 -0.027431 0.245598
polarizability: 3.47546893e+02 -2.05675528e+01 3.39745489e+02 1.13093706e-01 1.43477714e+01 1.45926214e+02
1716.lowfreq: -5.1832 -3.4011 -0.0008 -0.0007 -0.0004 3.4798 27.1537 36.9824 46.1653
frequency: 27.1517 36.9821 46.1512 58.5635 79.3997 84.8216 112.6720 120.2463 138.8983 168.3639 182.2911 240.4740 254.9379 271.5549 303.2712 325.2121 380.2789 390.4330 402.2670 406.6271 435.8188 443.4565 477.0832 490.2364 505.5879 518.0996 538.4949 564.4079 578.1011 584.3035 596.2233 609.0684 638.2334 642.2001 655.3656 693.6662 703.2613 710.3284 729.6105 747.0106 760.6307 766.6746 771.4665 794.4118 807.1169 831.5794 853.9525 865.6560 870.4659 871.8905 876.4625 882.3548 927.8838 933.3878 947.5559 965.8536 966.0540 982.9146 992.5174 994.1940 1020.4042 1025.1079 1044.9439 1061.6574 1079.6553 1109.0158 1116.9847 1151.9390 1161.2836 1174.3877 1183.0765 1185.1984 1187.9202 1229.4781 1252.4218 1271.2843 1279.7877 1283.3117 1289.5429 1303.7481 1341.2011 1357.5472 1369.9766 1382.5755 1400.2543 1430.6984 1442.0103 1442.9405 1445.8956 1452.9408 1472.7631 1484.2461 1505.8553 1526.4178 1551.9038 1562.0120 1593.6235 1606.8062 1613.7278 1630.6010 1636.6173 2995.4330 3107.8881 3124.3810 3128.8368 3130.1184 3137.4688 3140.4619 3146.0978 3156.7047 3157.3844 3165.5044 3169.9478 3170.4607 3173.6068 3357.0598 3502.3048
redmass: 6.0428 5.7162 5.7217 5.6093 7.1060 4.7613 3.9034 6.2190 4.4003 5.4822 4.8848 4.7217 4.7936 5.5439 5.7439 6.2493 5.7477 3.6248 4.4516 2.8992 5.1865 3.2289 2.9563 3.4411 3.2941 3.8909 4.2362 4.5293 4.9031 4.7360 5.9997 4.8525 2.9983 2.7995 3.6622 3.6518 3.0247 2.4817 1.7587 3.4496 1.3613 1.5690 1.3649 3.2117 3.1902 4.8404 2.2244 4.4788 2.0562 2.0834 2.0720 3.0241 2.0483 5.1574 1.4371 1.3629 1.3609 1.3152 1.3214 1.3262 2.2705 2.0662 2.1604 2.3731 3.3031 2.0830 2.0663 1.3227 1.1973 1.1380 1.1918 1.4776 1.5141 1.4321 2.9860 1.5407 2.3243 2.0474 1.9931 1.9909 2.4822 2.4011 2.8875 4.5703 3.2575 4.8381 2.3461 1.3799 2.0866 2.9963 2.3248 2.7355 2.9862 6.2504 7.5432 3.7750 4.0128 6.6275 5.1986 6.3412 4.7477 1.0653 1.0962 1.0877 1.0851 1.0857 1.0886 1.0893 1.0897 1.0957 1.0937 1.0951 1.0996 1.1001 1.0987 1.0782 1.0639
irintensity: 0.1122 0.6403 0.2546 2.1122 0.7743 1.0209 0.6804 2.7402 2.3815 1.9313 0.9951 0.2365 2.6171 0.8628 1.7519 5.9209 5.2897 6.3779 0.1919 7.7084 1.7604 15.9936 0.6431 5.8842 0.9862 33.0188 7.7610 48.4450 11.9437 4.2390 15.8506 16.0693 15.3632 62.2719 49.6735 39.8470 18.0294 59.5904 74.2518 3.4936 73.1053 149.4669 4.0654 16.8413 22.7809 4.3253 2.8237 4.7867 6.1741 3.3752 1.0716 0.5741 12.9660 7.6257 3.7353 3.2300 0.9898 0.4354 0.2460 0.2739 3.7472 12.4440 16.5158 214.4696 84.0573 10.9389 93.2862 4.5224 0.0662 1.5733 14.1769 4.1280 2.3545 0.6026 7.3377 2.2896 28.5291 5.7335 2.1158 6.0621 111.0106 57.4190 81.4872 26.9705 16.2002 146.9725 25.2546 44.8026 50.1384 8.5503 58.2016 10.8786 239.2362 41.8826 72.6533 54.4536 155.9886 10.9638 68.7508 4.4204 120.8780 13.7073 3.6494 9.2191 5.6136 5.2302 8.2661 7.1034 12.1667 16.4755 24.9321 16.3141 38.4474 13.2792 24.6642 259.5553 36.9973
temp: 298.150 k
press: 1.00000 atm
elementType: 8 8 7 7 6 6 6 6 6 6 6 6 6 6 6 6 6 6 6 6 6 6 6 6 6 1 1 1 1 1 1 1 1 1 1 1 1 1 1 1 1
symmnumber: 1
zpe: 831282.6 jmol-1
zpe.correction: 0.316619 hartree
zpe.thermalcorrener: 0.336308 hartree
zpe.thermalcorrenthalpy: 0.337252 hartree
zpe.thermalcorrgfe: 0.267486 hartree
zpe.sumelectzpe: -1068.110937 hartree
zpe.sumelectthermal: -1068.091248 hartree
zpe.sumelectthermalent: -1068.090304 hartree
zpe.sumelectthermalfe: -1068.160070 hartree
dipole: 4.8332 0.4056 -0.4562
dipole: 4.8716
quadrupole: -136.9734 -125.3357 -145.0102
quadrupole: 4.4128 -3.2685 0.2623
quadrupole: -1.2003 10.4374 -9.2371 4.4128 -3.2685 0.2623
hfenergy: -1068.427556 hartree
pointgroup: C01 [X(C21H16N2O2)]
dipole: 1.8897171 -0.15297 -0.2812476 debye
polarizability: 341.4391605|-21.7398104|343.0917176|-6.7933825|-25.7865091|148.6877186 unknown
InChI: InChI=1S/C21H16N2O2/c24-20(25)13-14-7-1-4-10-17(14)23-21-15-8-2-5-11-18(15)22-19-12-6-3-9-16(19)21/h1-12,23-24H,13H2
charge 0 multiplicity 1
41 atoms
O  4.937411 1.293549 -1.721533
O  2.756029 1.928162 -1.279458
N  0.703529 0.121588 -0.312933
N  -3.565552 0.532444 0.121826
C  -0.694341 0.226561 -0.150504
C  -1.290064 1.532927 -0.090787
C  -1.550807 -0.925357 -0.119391
C  -2.741552 1.624329 0.027771
C  -2.984734 -0.707596 0.051306
C  1.590341 -0.710492 0.423335
C  2.893972 -0.977647 -0.104553
C  -0.525178 2.752884 -0.121685
C  -1.082819 -2.273617 -0.30446
C  -3.356863 2.924952 0.070147
C  -3.860313 -1.849644 0.116478
C  3.296295 -0.474402 -1.492881
C  1.232975 -1.247364 1.69099
C  3.804198 -1.747283 0.656105
C  -1.157144 3.993847 -0.075555
C  -1.963003 -3.351745 -0.259681
C  -2.587713 4.082607 0.012985
C  -3.365093 -3.14114 -0.027363
C  2.148658 -2.02693 2.423009
C  3.444715 -2.278295 1.913904
C  3.597568 1.014438 -1.486822
H  1.166448 0.913027 -0.784774
H  0.568462 2.718849 -0.169556
H  -0.020991 -2.453878 -0.490374
H  -4.447793 2.953249 0.150892
H  -4.925174 -1.646447 0.26574
H  2.459383 -0.636049 -2.200596
H  4.180646 -1.017387 -1.857024
H  0.241124 -1.035096 2.100705
H  4.802559 -1.942939 0.246594
H  -0.558562 4.911079 -0.097754
H  -1.586555 -4.369552 -0.410054
H  -3.06778 5.067008 0.045698
H  -4.042089 -4.001476 0.017668
H  1.853514 -2.426981 3.399262
H  4.160238 -2.879278 2.484159
H  5.093055 2.277197 -1.679734
