program: Gaussian 09
title: 000152559
version: EM64L-G09RevD.01
frameworkgroup: C1[X(C23H26N2O2)]
method: RPBEPBE
basis: SDD
operation: Freq
keyword: #p
keyword: freq=noraman
keyword: PBEPBE/SDD
title: #p freq=noraman PBEPBE/SDD
converged: YES YES NO NO
title: Mulliken charges:
elementType: O O N N C C C C C C C C C C C C C C C C C C C C C C C H H H H H H H H H H H H H H H H H H H H H H H H H H
charge: -0.294521 -0.260304 -0.458673 -0.108285 0.034705 0.185311 -0.522881 -0.596148 0.239040 0.204362 0.321843 0.191651 -0.473008 -0.391061 -0.441821 -0.364606 0.229524 -0.360955 -0.269623 -0.247899 -0.385357 0.132639 -0.257187 -0.325678 -0.328222 -0.669770 -0.669967 0.243193 0.220882 0.234156 0.227759 0.303836 0.264580 0.228574 0.231479 0.235671 0.269762 0.225142 0.224970 0.209678 0.219379 0.241413 0.224704 0.205247 0.188314 0.208850 0.190263 0.210382 0.228804 0.206094 0.207038 0.229953 0.206770
chargesum: 0.00000
title: Mulliken charges with hydrogens summed into heavy atoms:
elementType: O O N N C C C C C C C C C C C C C C C C C C C C C C C
charge: -0.294521 -0.260304 -0.154837 -0.108285 0.034705 0.185311 -0.058807 -0.134233 0.239040 0.204362 0.321843 0.191651 -0.208428 -0.162487 -0.210341 -0.128935 0.229524 -0.091193 -0.044481 -0.022929 0.043699 0.132639 0.208930 0.067883 0.070892 -0.024490 -0.026206
polarizability: 3.73877881e+02 -1.91420375e+01 3.35552760e+02 -9.30584372e+00 -4.62047792e+00 1.56941166e+02
1716.lowfreq: -2.8101 -0.9805 -0.0006 0.0003 0.0006 5.7854 16.6416 22.3353 25.5415
frequency: 16.1087 22.1181 25.5330 42.5273 55.1340 61.3457 73.7887 83.0870 87.0111 100.4174 117.7796 141.6942 161.9710 174.6326 193.4511 208.3913 220.5661 231.1273 240.8227 280.9851 289.5861 300.0853 315.4518 337.5854 344.1452 354.0724 379.9784 407.6266 420.8003 436.3945 439.1045 468.1025 469.0701 510.5678 523.2903 541.9791 548.3714 550.0572 577.3394 599.0677 644.5244 659.7474 689.4053 703.2878 727.1483 736.9542 741.7051 763.3146 769.6978 778.9308 786.6884 792.9858 795.7024 811.9380 829.7324 830.3278 870.9937 883.0771 911.2380 921.1190 921.4723 942.3490 968.1362 969.3667 977.3091 981.1842 990.7156 1013.7736 1030.9727 1042.8182 1055.0995 1062.6548 1063.6583 1076.3275 1085.6868 1095.3673 1098.3760 1123.2426 1130.2025 1154.7005 1164.6016 1169.8149 1173.8666 1190.7043 1205.0105 1208.0557 1227.0539 1232.6279 1234.2726 1269.4254 1275.9595 1286.9447 1289.7896 1292.6568 1292.8690 1314.5079 1326.5814 1334.8344 1357.8237 1362.5469 1367.3470 1378.3091 1385.8879 1387.7061 1388.4680 1418.7987 1435.6880 1444.1423 1450.5350 1456.2167 1461.6053 1462.3238 1463.8859 1470.5925 1471.4556 1472.1826 1480.0186 1485.9658 1487.7696 1491.4708 1505.9085 1558.4264 1579.0158 1592.8837 1611.9017 1615.8274 1627.2661 2853.0481 2861.8925 2903.8044 2953.9243 2961.0352 2982.4343 2983.7190 3015.9301 3023.3664 3025.6289 3034.8228 3046.9850 3050.4108 3074.2466 3076.0857 3089.8427 3092.5540 3093.1087 3114.1521 3131.2788 3136.6202 3151.9701 3167.2453 3168.3098 3189.3836 3599.5245
redmass: 3.5989 3.9947 4.6453 4.2435 5.5757 2.7547 3.3305 4.8208 2.1529 3.8707 3.6987 2.5876 3.3251 2.5012 1.8441 2.4380 2.4677 1.8633 3.0530 1.9783 3.9510 2.7184 3.3275 3.9010 4.6250 4.4713 5.4544 3.4728 2.8091 3.0351 3.0934 3.8733 2.8444 4.0891 3.7158 5.4186 3.8885 1.3229 3.2254 3.9390 5.1208 5.9811 4.0294 6.0409 4.3073 2.5777 2.7382 2.5011 3.0275 2.8159 1.1777 1.5752 1.1695 2.3506 2.0124 2.2060 1.3927 3.3107 2.5708 2.0630 2.2269 1.4129 4.5286 1.3404 2.9241 1.3304 2.2404 2.7719 2.5087 2.6318 2.8748 1.9234 2.3546 1.9210 2.1606 2.8666 2.5585 1.7263 1.4760 1.2465 1.4021 1.8124 1.1033 1.3180 1.9398 2.2587 2.0043 1.7556 1.4087 2.0973 1.1149 1.2682 1.8490 1.2473 1.5550 1.6600 1.4386 2.2912 2.2203 1.3390 1.3573 4.8776 1.2515 1.3657 1.3205 3.8533 2.3636 2.4261 1.1962 1.4979 1.0594 1.0549 2.5275 1.1113 1.4819 1.9349 1.0574 1.0719 1.0685 1.0749 3.9400 6.5340 6.4022 6.4578 11.0436 7.0392 7.3347 1.0720 1.0714 1.0704 1.0675 1.0629 1.0358 1.0357 1.0586 1.0872 1.0956 1.0874 1.0955 1.0895 1.0986 1.0980 1.1076 1.1003 1.1003 1.0873 1.0884 1.0894 1.0946 1.0957 1.0976 1.0915 1.0804
irintensity: 0.7545 0.7154 0.3594 0.5828 0.0788 0.0853 0.2988 2.0312 0.0759 0.3531 2.5740 0.1926 0.9255 0.8887 1.9823 2.5174 3.4167 0.8994 1.6188 7.2908 3.8716 3.0458 1.8835 2.1424 1.2963 1.0307 4.5766 14.5562 0.9310 10.6064 3.1121 6.2293 4.7854 2.3332 3.1437 2.3584 3.4200 68.7414 10.0321 0.6923 21.7405 6.9708 25.4064 8.6189 10.3939 7.1661 15.2818 47.4597 10.2744 17.8606 4.3368 1.5034 3.8485 11.5778 16.3674 18.9731 0.3394 3.1827 9.5213 20.8602 20.0280 3.8161 22.5101 0.3496 14.7507 0.2791 4.8481 23.4691 11.1236 110.5179 118.9919 60.3696 120.5804 16.7577 2.7691 3.5660 54.8703 7.9558 32.2965 4.4261 8.5090 30.2955 11.7792 2.4382 5.1290 58.2128 213.9327 94.4543 10.9875 105.4580 2.4456 4.9235 25.1957 26.3591 1.0300 24.9532 13.6619 26.2218 47.8263 2.7074 10.9212 12.3622 28.9394 10.3322 12.1635 2.0839 3.8493 11.7049 6.7985 11.4972 2.0272 8.0431 42.9768 5.6680 16.7699 47.2946 7.9857 11.6925 11.4274 9.9380 76.6682 13.8990 18.6431 21.4224 280.9763 3.2686 36.5202 32.3070 149.6492 88.3602 45.2252 30.1720 32.5697 32.8548 27.8447 14.9126 37.7466 18.9732 37.4425 12.7418 35.3208 84.0272 40.0596 29.7305 45.1966 13.5824 10.4088 11.3335 41.7680 1.9764 22.0467 0.6686 69.4476
temp: 298.150 k
press: 1.00000 atm
elementType: 8 8 7 7 6 6 6 6 6 6 6 6 6 6 6 6 6 6 6 6 6 6 6 6 6 6 6 1 1 1 1 1 1 1 1 1 1 1 1 1 1 1 1 1 1 1 1 1 1 1 1 1 1
symmnumber: 1
zpe: 1152757.3 jmol-1
zpe.correction: 0.439062 hartree
zpe.thermalcorrener: 0.464266 hartree
zpe.thermalcorrenthalpy: 0.465210 hartree
zpe.thermalcorrgfe: 0.381482 hartree
zpe.sumelectzpe: -1150.062540 hartree
zpe.sumelectthermal: -1150.037336 hartree
zpe.sumelectthermalent: -1150.036392 hartree
zpe.sumelectthermalfe: -1150.120120 hartree
dipole: -4.3041 1.3989 -0.3917
dipole: 4.5427
quadrupole: -121.7617 -154.7986 -163.8188
quadrupole: 24.9830 -5.1500 0.5013
quadrupole: 25.0313 -8.0056 -17.0257 24.9830 -5.1500 0.5013
hfenergy: -1150.5016017 hartree
pointgroup: C01 [X(C23H26N2O2)]
dipole: -1.7114076 0.4377829 -0.2713122 debye
polarizability: 375.9209706|-17.2654626|328.8767973|0.1683945|-29.8382435|161.57404 unknown
InChI: InChI=1S/C23H26N2O2/c1-3-25(4-2)13-14-27-23(26)17-10-11-20-19(15-17)22-18-8-6-5-7-16(18)9-12-21(22)24-20/h5-8,10-11,15,24H,3-4,9,12-14H2,1-2H3
charge 0 multiplicity 1
53 atoms
O  2.358919 -0.774529 0.230251
O  2.684702 -3.051371 0.602405
N  -3.746315 -2.395169 0.154102
N  5.557627 1.151614 -0.047317
C  -2.921584 -0.283148 -0.150102
C  -4.086272 -1.056627 -0.069261
C  -5.474357 -0.516134 -0.263677
C  -5.486319 0.961696 0.211812
C  -3.019107 1.153295 -0.448788
C  -1.797076 -1.191845 0.050255
C  -4.307483 1.773644 -0.323869
C  -2.35448 -2.512991 0.236477
C  -0.391285 -1.043781 0.113292
C  -1.919286 1.939789 -0.883104
C  -4.453497 3.141854 -0.634383
C  -1.556931 -3.655201 0.464932
C  0.416789 -2.183984 0.339237
C  -0.165065 -3.479193 0.509536
C  -2.079282 3.310212 -1.181598
C  -3.348613 3.918169 -1.059261
C  4.097164 0.893741 -0.000961
C  1.899724 -2.087318 0.408996
C  3.835681 -0.588505 0.29296
C  5.947422 2.464624 0.530295
C  6.144162 0.897038 -1.391322
C  5.879857 2.483389 2.069148
C  7.635027 0.512586 -1.335033
H  -5.755103 -0.571222 -1.336697
H  -6.227143 -1.100915 0.299015
H  -5.439143 0.964907 1.32144
H  -6.440415 1.442161 -0.070544
H  -4.410464 -3.159911 0.257863
H  0.094144 -0.071927 0.006958
H  -0.937522 1.475672 -1.013894
H  -5.441074 3.610285 -0.53769
H  -2.001569 -4.64663 0.603015
H  0.506421 -4.326544 0.679398
H  -1.217578 3.898253 -1.516805
H  -3.480035 4.979826 -1.295576
H  3.583433 1.179799 -0.949063
H  3.640819 1.497662 0.802908
H  4.200491 -0.869216 1.295976
H  4.313254 -1.256196 -0.446848
H  6.988784 2.6703 0.22264
H  5.324633 3.296519 0.113008
H  5.583732 0.061136 -1.85029
H  6.003934 1.77753 -2.068875
H  4.855811 2.293161 2.439245
H  6.541543 1.704488 2.486128
H  6.198183 3.468417 2.459068
H  8.253598 1.319308 -0.901647
H  7.770124 -0.389455 -0.713538
H  8.019522 0.306034 -2.351419
