program: Gaussian 09
title: 000152549
version: EM64L-G09RevD.01
frameworkgroup: C1[X(C8H7N3O2)]
method: RPBEPBE
basis: SDD
operation: Freq
keyword: #pfreq=noraman
keyword: PBEPBE/SDD
title: #p freq=noraman PBEPBE/SDD
converged: NO YES NO NO
title: Mulliken charges:
elementType: O O N N N C C C C C C C C H H H H H H H
charge: -0.287528 -0.248902 -0.255360 -0.050833 -0.621508 0.406352 -0.072648 -0.356800 0.056401 -0.358768 0.189602 -0.255129 -0.163381 0.288841 0.317573 0.231609 0.256507 0.261662 0.319986 0.342324
chargesum: 0.00000
title: Mulliken charges with hydrogens summed into heavy atoms:
elementType: O O N N N C C C C C C C C
charge: -0.287528 -0.248902 -0.255360 -0.050833 0.040801 0.406352 0.216193 -0.039227 0.056401 -0.127159 0.189602 0.001378 0.098281
polarizability: 2.11307171e+02 1.17767039e+01 1.14511298e+02 -8.88573052e-03 2.68840637e-02 4.52323035e+01
1716.lowfreq: -5.8562 -4.6378 0.0002 0.0005 0.0010 6.9120 43.6660 64.2979 157.3908
frequency: 43.6605 64.2787 157.3898 170.8105 200.6710 303.9451 338.4227 347.7019 364.7668 422.4510 430.4566 554.3442 565.3299 581.3911 581.8147 604.2133 631.2004 688.4927 701.6524 719.1141 735.6040 775.8879 829.4794 861.0251 868.0969 888.2721 893.0681 942.8049 951.1766 999.3716 1015.3721 1038.0003 1116.6243 1134.2476 1193.9401 1205.6767 1257.1443 1289.7318 1343.4346 1362.0806 1486.8124 1497.1544 1502.5315 1578.6650 1603.5460 1638.4739 1657.4801 3174.6808 3199.3816 3227.1109 3271.9493 3280.5620 3540.9574 3699.2514
redmass: 4.5417 5.5284 5.8000 5.1025 7.3372 9.2475 5.5182 3.3108 6.9227 1.8048 1.5943 7.7472 1.2276 5.5290 3.2202 8.0746 4.5978 3.1317 1.3344 7.5274 7.4898 1.6873 1.2466 5.0656 6.5912 1.3328 5.1047 4.2123 1.3228 1.8754 2.0904 2.0428 1.6643 1.5920 3.2207 1.6594 5.4962 1.9677 1.8856 2.7843 3.7984 6.3170 4.8746 7.3286 1.6932 3.1880 8.9502 1.0894 1.0997 1.0929 1.1021 1.1047 1.0454 1.1045
irintensity: 0.1878 8.7447 0.3597 6.4891 2.5468 1.9826 8.9201 3.3632 1.2189 24.8447 133.4443 0.1934 133.5133 7.4997 17.0760 10.3282 1.5846 0.0476 81.2888 5.5381 9.5120 86.3865 43.3973 13.8809 7.6667 4.9531 14.7681 23.8583 1.1157 21.3827 36.9258 12.2879 1.4807 11.3238 37.1913 34.0065 9.8868 122.6625 47.7358 6.6171 166.2278 52.8131 94.4599 79.0120 120.2805 402.8857 629.2582 1.8826 2.7112 4.4711 2.5209 5.6911 144.6416 40.5151
temp: 298.150 k
press: 1.00000 atm
elementType: 8 8 7 7 7 6 6 6 6 6 6 6 6 1 1 1 1 1 1 1
symmnumber: 1
zpe: 380004.0 jmol-1
zpe.correction: 0.144736 hartree
zpe.thermalcorrener: 0.155264 hartree
zpe.thermalcorrenthalpy: 0.156208 hartree
zpe.thermalcorrgfe: 0.107995 hartree
zpe.sumelectzpe: -622.816452 hartree
zpe.sumelectthermal: -622.805924 hartree
zpe.sumelectthermalent: -622.804980 hartree
zpe.sumelectthermalfe: -622.853193 hartree
dipole: -1.5787 -5.5182 0.0101
dipole: 5.7396
quadrupole: -44.0804 -78.0771 -78.7922
quadrupole: 8.1786 -0.0180 0.0215
quadrupole: 22.9028 -11.0939 -11.8090 8.1786 -0.0180 0.0215
hfenergy: -622.9611881 hartree
pointgroup: C01 [X(C8H7N3O2)]
dipole: -0.7283679 0.9666908 -1.906361 debye
dipolederiv: -0.5064179 0.0876479 -0.1635602 0.020306 -0.212493 0.1674828 -0.0303328 0.1660066 -0.454645 -0.5884446 0.182224 -0.3591428 0.0847929 -0.520478 0.2859221 -0.1642091 0.2832108 -0.9368068 -1.0676316 -0.1043991 0.2319441 0.2839814 -0.1612167 0.3380818 -0.5322911 0.3483396 -0.6640668 -1.1184134 0.212514 -0.4064976 0.1663271 -0.4047042 0.1805915 -0.3176349 0.1803172 -0.6635674 -1.8346112 0.050375 -0.0747622 -0.0577808 -0.6004863 -0.2124293 0.1385815 -0.2149455 -0.2864068 0.9307115 0.0047777 -0.0305076 -0.0215455 0.1073497 -0.0970384 0.0225935 -0.0972303 0.2501145 1.0723836 -0.0798372 0.1321785 -0.3603291 0.0556075 -0.1005799 0.6864144 -0.1082464 0.195601 -0.1408825 0.0315327 -0.0649855 0.0755786 -0.1647036 -0.0432373 -0.1512218 -0.0424694 -0.0965258 1.284693 -0.1848842 0.3500269 -0.0088149 0.5271343 -0.562441 -0.0018872 -0.5589494 1.3583448 -1.1399529 -0.0325635 0.0837402 -0.2446048 -0.260679 -0.0101825 0.4983723 -0.0154089 -0.25196 2.140729 -0.0923975 0.1453055 0.1884074 0.3664015 -0.2447748 -0.4032675 -0.2375956 0.7248995 0.0791419 -0.0179595 0.0278536 -0.0272309 -0.1651721 -0.0552228 0.0464181 -0.0553832 -0.0853371 -0.0219032 -0.0700418 0.1328701 -0.1193711 -0.0959891 -0.143653 0.2297129 -0.1452131 0.111876 0.128219 -0.0222302 0.0443809 -0.0204543 0.1410514 0.0517701 0.0399112 0.0514801 0.0647372 0.1834244 -0.0200112 0.0410062 -0.0139247 0.1922178 0.0466031 0.0280988 0.0468004 0.1215892 0.0237518 0.0295639 -0.0538802 0.0247153 0.146075 0.100094 -0.0445361 0.0996621 0.002569 -0.0340118 0.0231243 -0.0392154 0.0300065 0.1771471 0.0338113 -0.052698 0.0340734 0.1286672 0.0686065 -0.009051 0.0229753 -0.0170069 0.1940956 0.0785035 0.0398743 0.0784962 0.0764875 0.2791234 -0.0017891 0.0050205 -0.0296962 0.3394735 0.1015343 0.0579657 0.1011922 0.1890201 0.261485 0.013405 -0.0247503 0.046644 0.3393687 0.0851642 -0.089864 0.0858632 0.2154096 unknown
polarizability: 212.2185709|-4.7224873|59.2094345|5.3534947|-27.5481762|99.6227675 unknown
InChI: InChI=1S/C8H7N3O2/c9-6-3-4-11(8(12)10-6)7-2-1-5-13-7/h1-5H,9H2
charge 0 multiplicity 1
20 atoms
O  1.989464 0.872832 -1.067175
O  -0.117634 -0.737735 2.183939
N  -0.031197 0.326445 0.066852
N  -2.153695 -0.202099 1.155865
N  -4.170096 0.330886 0.142544
C  1.380892 0.306189 0.072258
C  -0.719822 0.879016 -1.005028
C  2.346252 -0.153676 0.955656
C  -0.777855 -0.251363 1.22967
C  -2.098089 0.9087 -1.032499
C  -2.794899 0.339747 0.099881
C  3.628066 0.135886 0.343947
C  3.387076 0.751688 -0.868165
H  -0.107276 1.282583 -1.813294
H  2.143872 -0.629608 1.908566
H  -2.621342 1.348708 -1.883471
H  4.60568 -0.090896 0.764528
H  4.003225 1.146365 -1.670107
H  -4.735479 0.715127 -0.60918
H  -4.616141 -0.080195 0.961414
