program: Gaussian 09
title: 000152517
version: EM64L-G09RevD.01
frameworkgroup: C1[X(C26H16O4)]
method: RPBEPBE
basis: SDD
operation: Freq
keyword: #pfreq=noraman
keyword: PBEPBE/SDD
title: #p freq=noraman PBEPBE/SDD
converged: YES YES NO NO
title: Mulliken charges:
elementType: O O O O C C C C C C C C C C C C C C C C C C C C C C C C C C H H H H H H H H H H H H H H H H
charge: -0.434671 -0.434680 -0.243486 -0.243504 -0.462240 -0.462241 0.259146 0.258945 -0.005614 -0.005635 0.193361 0.193392 0.203685 0.203705 0.124850 0.124863 -0.378334 -0.378295 0.410828 0.410834 -0.505048 -0.505085 -0.386640 -0.386681 -0.442777 -0.442767 -0.257318 -0.257363 -0.245822 -0.245820 0.296228 0.296241 0.270165 0.270180 0.244462 0.244464 0.272600 0.272641 0.244237 0.244234 0.231539 0.231542 0.378370 0.378368 0.232570 0.232568
chargesum: 0.00000
title: Mulliken charges with hydrogens summed into heavy atoms:
elementType: O O O O C C C C C C C C C C C C C C C C C C C C C C C C C C
charge: -0.056301 -0.056313 -0.243486 -0.243504 -0.166013 -0.166000 0.259146 0.258945 -0.005614 -0.005635 0.193361 0.193392 0.203685 0.203705 0.124850 0.124863 -0.108169 -0.108115 0.410828 0.410834 -0.260586 -0.260621 -0.114039 -0.114040 -0.198540 -0.198532 -0.025779 -0.025821 -0.013252 -0.013251
polarizability: 4.69171155e+02 2.53010723e+01 3.68660825e+02 5.04813295e-03 1.70358354e-02 2.06977432e+02
1716.lowfreq: -6.1947 0.0006 0.0007 0.0007 3.5872 4.2951 32.3297 36.7434 42.1380
frequency: 32.3285 36.7413 42.1352 42.6811 56.3233 57.2436 86.3005 97.7499 105.3700 142.7234 156.0189 185.1507 192.0334 229.4181 232.8569 237.3024 251.5016 254.0858 299.6905 300.4641 313.5990 344.2280 395.9013 416.7103 429.3107 441.0151 478.5374 484.8480 490.3104 509.7440 521.1116 523.5387 530.5299 554.1309 571.8112 582.1006 590.1906 591.2794 617.3423 633.1818 654.0746 663.7467 669.8461 688.8622 697.9924 705.4954 707.5379 722.4498 755.6709 761.6420 770.6172 779.0061 788.4967 799.4583 831.4039 833.1274 869.7392 873.7826 880.5208 882.3889 884.9344 890.8895 916.0416 916.1395 946.7483 962.1897 962.6237 979.3561 979.5819 996.6722 998.2202 998.8097 1026.4203 1034.1071 1036.9767 1053.0604 1075.6833 1093.2247 1155.8283 1158.6177 1175.6931 1178.6409 1187.4159 1206.6205 1215.3289 1234.2818 1239.4771 1240.0757 1253.6104 1269.6307 1280.6272 1287.7440 1351.0007 1352.3139 1383.0109 1390.7320 1392.4271 1407.5404 1408.8162 1409.4199 1426.7566 1431.2119 1451.1910 1462.6974 1515.1382 1515.8734 1550.0139 1560.9738 1590.2869 1593.6499 1603.7038 1607.3766 1626.4010 1627.0591 1627.7917 1629.0142 3125.3037 3125.3113 3136.0700 3136.1194 3138.2507 3138.2727 3156.4903 3156.5691 3161.9042 3162.1830 3172.3160 3172.4200 3197.6889 3197.7462 3524.0090 3524.1452
redmass: 6.6558 6.7284 12.0840 11.4642 6.1875 5.3972 4.7210 5.3028 6.1708 6.4227 4.8678 5.0222 5.5656 5.1520 5.9027 4.8220 7.1036 6.1496 5.4542 5.5606 6.7240 6.1853 4.8285 3.5761 3.5134 4.7175 5.1348 5.2557 3.8079 4.9765 5.8946 4.3516 3.7143 6.0565 3.6863 4.3084 1.2646 1.2717 4.6300 6.2822 6.2116 4.1013 5.3446 5.4578 4.5515 3.4806 6.2473 3.2799 3.1839 1.3213 1.7874 5.1011 3.4606 3.8805 1.5789 1.4401 5.2152 4.2722 2.0409 2.6385 2.4599 3.2198 1.6884 1.4981 4.2018 1.3446 1.3629 1.3937 1.4022 2.7099 1.3299 1.7151 2.8604 2.3432 2.4397 2.1993 3.4586 2.9324 1.4764 1.4582 1.2078 1.1053 1.3608 1.9027 1.5758 1.6825 1.8595 2.0635 1.8582 1.7599 1.7787 2.8820 2.4435 3.3982 3.8785 2.0098 2.1908 3.4323 4.3227 3.9564 3.2715 3.4419 2.1857 2.2564 3.6316 3.7226 7.1102 7.4732 6.7129 6.7148 6.9046 7.3922 6.5826 6.9667 7.3691 7.6039 1.0866 1.0866 1.0905 1.0905 1.0895 1.0895 1.0943 1.0943 1.0913 1.0913 1.0974 1.0973 1.0944 1.0944 1.0641 1.0641
irintensity: 0.0004 1.3073 1.0288 0.4474 0.2573 0.0865 0.0116 0.2710 0.0308 1.7883 0.3309 0.0053 0.2242 1.7521 4.7210 3.5469 0.2340 0.4060 6.4117 13.2149 0.1999 0.4934 4.8217 0.2811 11.3236 1.0379 29.8178 1.4065 27.5343 3.7971 1.5116 31.4362 4.4282 16.0595 26.0626 4.3459 110.1710 129.1342 4.1135 0.1059 6.2203 0.0836 29.4799 0.7402 29.0380 16.5784 11.1009 2.1423 2.1178 17.8870 75.4757 3.3993 8.8496 1.8700 4.7259 97.5528 2.5707 12.2518 10.2223 35.8510 2.0098 0.7176 12.7864 12.6002 31.5429 1.8556 4.5272 1.5935 0.4407 187.1011 4.4546 87.1610 167.9792 81.3277 336.9982 173.7323 210.1783 33.8474 2.1171 9.9742 6.6200 1.0198 1.8104 0.6908 0.3785 5.4416 7.7102 0.3993 5.5525 9.6038 0.4698 79.8219 28.4540 10.9958 35.4073 37.1804 0.0586 5.2244 6.2108 1.8199 10.0134 0.7609 26.4919 1.8481 16.2695 3.8167 1.0709 19.1108 69.2824 206.7949 174.2570 124.6290 9.0521 216.5695 255.9405 5.8845 2.4072 0.1977 6.8210 0.5167 1.6258 30.8052 50.3911 8.9569 14.4483 0.2946 32.4441 6.9022 4.6066 3.2075 81.4781 55.9918
temp: 298.150 k
press: 1.00000 atm
elementType: 8 8 8 8 6 6 6 6 6 6 6 6 6 6 6 6 6 6 6 6 6 6 6 6 6 6 6 6 6 6 1 1 1 1 1 1 1 1 1 1 1 1 1 1 1 1
symmnumber: 1
zpe: 899399.6 jmol-1
zpe.correction: 0.342563 hartree
zpe.thermalcorrener: 0.366010 hartree
zpe.thermalcorrenthalpy: 0.366954 hartree
zpe.thermalcorrgfe: 0.288908 hartree
zpe.sumelectzpe: -1299.277015 hartree
zpe.sumelectthermal: -1299.253568 hartree
zpe.sumelectthermalent: -1299.252624 hartree
zpe.sumelectthermalfe: -1299.330670 hartree
dipole: -0.0002 -0.0007 -2.0117
dipole: 2.0117
quadrupole: -149.3423 -155.8933 -170.4393
quadrupole: 5.3090 -0.0007 0.0018
quadrupole: 9.2160 2.6650 -11.8810 5.3090 -0.0007 0.0018
hfenergy: -1299.6195781 hartree
pointgroup: C01 [X(C26H16O4)]
dipole: 0.0000403 -0.7914744 0.0006819 debye
polarizability: 454.1291928|0.0035178|206.9774552|-43.8834415|0.0638437|383.7027635 unknown
InChI: InChI=1S/C26H16O4/c27-23(28)13-21-20-12-10-16-6-2-4-8-18(16)26(20)22(14-24(29)30)19-11-9-15-5-1-3-7-17(15)25(19)21/h1-14,27,29H
charge 0 multiplicity 1
46 atoms
O  -1.201557 2.836178 3.989761
O  1.2010 2.831892 -3.993271
O  0.938082 2.009768 3.626452
O  -0.938426 2.005416 -3.62888
C  -1.001708 1.248988 2.273685
C  1.001588 1.246736 -2.275225
C  -0.500015 0.415742 1.292593
C  0.499885 0.414364 -1.292963
C  -1.414185 -0.077783 0.219768
C  1.414093 -0.07785 -0.219567
C  0.916596 -0.000859 1.106092
C  -0.916702 -0.002132 -1.105968
C  -2.745742 -0.589372 0.470067
C  2.745759 -0.589348 -0.469322
C  -0.279393 2.002591 3.311026
C  0.279042 1.998977 -3.313429
C  1.748219 -0.375795 2.209214
C  -1.748323 -0.378187 -2.2087
C  -3.575091 -0.948821 -0.666207
C  3.575119 -0.947632 0.667306
C  3.046673 -0.822854 1.993082
C  -3.046725 -0.825158 -1.992118
C  -3.273913 -0.828571 1.785749
C  3.27405 -0.829452 -1.784785
C  -4.898345 -1.453947 -0.44821
C  4.898461 -1.452738 0.449788
C  -4.563025 -1.334977 1.967618
C  4.563253 -1.3358 -1.966169
C  -5.394178 -1.633458 0.843649
C  5.39438 -1.633253 -0.841902
H  -2.066174 1.497323 2.237743
H  2.066064 1.495138 -2.239761
H  1.356196 -0.297886 3.223729
H  -1.356317 -0.301197 -3.223299
H  3.680023 -1.100559 2.843109
H  -3.680061 -1.103751 -2.841865
H  -2.648042 -0.639492 2.661564
H  2.64821 -0.641068 -2.66078
H  -5.512476 -1.708323 -1.32007
H  5.512603 -1.706261 1.321888
H  -4.937913 -1.514295 2.981096
H  4.938239 -1.515856 -2.97948
H  -0.703986 3.362675 4.672245
H  0.703278 3.357449 -4.676368
H  -6.406702 -2.020161 1.001267
H  6.406984 -2.019899 -0.99915
