program: Gaussian 09
title: 000152509
version: EM64L-G09RevD.01
frameworkgroup: C1[X(C11H14BrNO2)]
method: RPBEPBE
basis: SDD
operation: Freq
keyword: #p
keyword: freq=noraman
keyword: PBEPBE/SDD
title: #p freq=noraman PBEPBE/SDD
converged: YES YES NO NO
title: Mulliken charges:
elementType: Br O O N C C C C C C C C C C C H H H H H H H H H H H H H H
charge: -0.043895 -0.287073 -0.258570 -0.304905 0.105196 0.403468 -0.373145 -0.253339 0.198386 -0.323677 -0.329515 -0.874338 -0.226846 -0.225463 -0.621139 0.197088 0.224052 0.253396 0.217727 0.273635 0.239775 0.345634 0.283166 0.257962 0.236815 0.236586 0.225322 0.230272 0.193426
chargesum: 0.00000
title: Mulliken charges with hydrogens summed into heavy atoms:
elementType: Br O O N C C C C C C C C C C C
charge: -0.043895 -0.287073 -0.258570 -0.046943 0.105196 0.403468 0.047994 0.217784 0.198386 -0.050042 -0.089740 -0.245538 0.009968 0.011124 0.027881
polarizability: 1.87944221e+02 4.65693805e+00 1.68993415e+02 -4.75738300e-01 -8.71922110e+00 1.00815407e+02
1716.lowfreq: -7.1641 -3.6913 -0.0006 -0.0002 0.0001 2.7116 13.5109 29.2192 50.3389
frequency: 13.4466 29.1588 50.3331 53.2254 65.0199 82.2198 96.2501 119.8455 177.6247 178.9099 222.7769 235.7634 257.7117 301.2077 373.9024 385.3316 416.7909 426.8778 458.2227 516.5913 561.8578 581.6320 649.3213 658.2410 683.0682 767.0825 783.3614 787.4710 806.8806 829.3572 882.5527 896.4879 918.5018 967.5112 974.3197 1003.0619 1038.5634 1042.7771 1048.3596 1085.4200 1092.5139 1120.6417 1149.4708 1155.1042 1170.6121 1179.8586 1214.4505 1219.9363 1227.2655 1235.4458 1264.8736 1294.2510 1319.5298 1383.3992 1386.6471 1431.5786 1437.5775 1447.2323 1454.2877 1468.6517 1472.1669 1480.7727 1488.3486 1497.3432 1579.5591 1601.4700 1616.1690 2876.8767 2885.1343 3005.6545 3018.9649 3032.8257 3077.4005 3080.1130 3090.0956 3129.2028 3143.2054 3161.9692 3175.3183 3182.9012 3456.4543
redmass: 5.1703 5.0148 7.7374 2.6666 2.7149 5.9561 2.9748 3.6295 4.2077 2.3885 4.2278 1.4388 5.2338 4.0382 4.6531 3.3526 3.4557 3.5387 4.7964 4.9293 6.4377 3.9092 2.1586 2.2028 4.2801 2.7589 2.1086 3.3343 1.1451 5.3493 1.5694 1.4781 5.8105 2.2441 1.4053 1.3538 3.5904 1.6997 2.5060 1.9725 1.5460 1.5745 1.3024 1.5289 2.9516 1.0632 3.1457 1.5373 1.2951 2.2200 1.1138 1.4433 1.3364 4.5705 1.7678 2.0694 1.1523 1.1834 1.2000 1.0742 1.0823 2.5595 1.0672 1.0619 6.7262 7.1846 8.2209 1.0637 1.0626 1.0621 1.0761 1.0868 1.0588 1.0997 1.1053 1.0870 1.0906 1.0970 1.1097 1.0963 1.0746
irintensity: 0.6264 0.8140 0.8399 0.1606 1.7821 0.6025 3.4864 2.3987 2.5803 1.0164 1.1304 1.5540 3.8651 16.8583 0.5374 5.3645 24.8284 2.0944 15.2198 12.6047 13.4595 36.1799 72.8009 59.9416 33.8378 18.9754 28.0456 9.8545 2.5428 3.2109 5.4314 0.4119 18.7361 0.7791 2.9033 0.2854 86.7115 142.8280 85.4040 2.7075 72.2858 0.0228 23.0961 7.6407 59.2929 1.4987 117.1545 5.7103 52.0181 208.7728 3.3311 2.4082 3.5590 2.7830 11.0988 5.2745 2.7172 40.0913 16.6698 9.0895 3.6218 11.6457 14.5936 9.7494 18.4115 55.8415 106.4439 77.5197 163.2123 17.0290 49.4261 19.2593 23.4690 37.4248 27.0677 3.1312 11.9240 22.1596 5.7106 8.5686 0.5341
temp: 298.150 k
press: 1.00000 atm
elementType: 35 8 8 7 6 6 6 6 6 6 6 6 6 6 6 1 1 1 1 1 1 1 1 1 1 1 1 1 1
symmnumber: 1
zpe: 604905.6 jmol-1
zpe.correction: 0.230396 hartree
zpe.thermalcorrener: 0.246359 hartree
zpe.thermalcorrenthalpy: 0.247304 hartree
zpe.thermalcorrgfe: 0.182684 hartree
zpe.sumelectzpe: -645.091147 hartree
zpe.sumelectthermal: -645.075184 hartree
zpe.sumelectthermalent: -645.074240 hartree
zpe.sumelectthermalfe: -645.138859 hartree
dipole: -2.0977 4.3625 0.4903
dipole: 4.8654
quadrupole: -77.9328 -97.5221 -99.0953
quadrupole: 4.9705 1.4228 -1.7743
quadrupole: 13.5840 -6.0054 -7.5786 4.9705 1.4228 -1.7743
hfenergy: -645.3215435 hartree
pointgroup: C01 [X(C11H14Br1N1O2)]
dipole: 0.0977453 -1.7851259 -0.6840265 debye
polarizability: 188.0695934|-6.4391964|148.4956053|4.5240965|31.7013846|121.1878449 unknown
InChI: InChI=1S/C11H14BrNO2/c1-13-6-7-15-11(14)10-5-3-2-4-9(10)8-12/h2-5,13H,6-8H2,1H3
charge 0 multiplicity 1
29 atoms
Br -2.118759 3.645997 0.883317
O  1.156328 -0.143332 -0.149702
O  0.375869 0.831963 1.804952
N  4.869907 -0.448089 -0.212837
C  -1.21816 0.066225 0.085741
C  -2.393381 0.726004 0.57355
C  3.479045 -0.555665 -0.691513
C  2.543514 0.044867 0.361864
C  0.132421 0.309854 0.687096
C  -1.331707 -0.869957 -0.9772
C  -3.641877 0.409716 -0.023323
C  -2.377076 1.753365 1.66884
C  -2.582396 -1.170371 -1.55185
C  -3.746329 -0.528773 -1.069842
C  5.904141 -0.7093 -1.230752
H  3.155654 -1.599935 -0.924832
H  3.388334 0.026023 -1.627658
H  2.737116 1.120921 0.507475
H  2.632256 -0.460664 1.342482
H  -0.423833 -1.357937 -1.340279
H  -4.539858 0.925181 0.337036
H  -1.533308 1.652694 2.360423
H  -3.343424 1.829126 2.186343
H  5.025156 -0.987655 0.648326
H  -2.648811 -1.897651 -2.367839
H  -4.724554 -0.75451 -1.507846
H  6.904267 -0.616354 -0.772246
H  5.833446 0.050614 -2.030705
H  5.835318 -1.714557 -1.713624
