program: Gaussian 09
title: 000152507
version: EM64L-G09RevD.01
frameworkgroup: C1[X(C14H15N3O2)]
method: RPBEPBE
basis: SDD
operation: Freq
keyword: #p
keyword: freq=noraman
keyword: PBEPBE/SDD
title: #p freq=noraman PBEPBE/SDD
converged: YES YES NO NO
title: Mulliken charges:
elementType: O O N N N C C C C C C C C C C C C C C H H H H H H H H H H H H H H H
charge: -0.314714 -0.271217 -0.116517 -0.131798 -0.667358 0.233779 0.314502 0.161814 -0.473170 -0.343728 -0.296454 0.208251 0.363647 -0.490095 -0.331509 -0.373940 -0.188417 -0.527308 -0.537077 0.260392 0.221621 0.274813 0.269008 0.269673 0.239196 0.218749 0.308541 0.342324 0.239372 0.227369 0.227454 0.219467 0.219440 0.243890
chargesum: 0.00000
title: Mulliken charges with hydrogens summed into heavy atoms:
elementType: O O N N N C C C C C C C C C C C C C C
charge: -0.314714 -0.271217 -0.116517 -0.131798 -0.016494 0.233779 0.314502 0.161814 -0.212778 -0.122107 -0.021641 0.208251 0.363647 -0.221087 -0.061836 -0.134744 0.030332 0.166887 0.145720
polarizability: 4.72835673e+02 2.84646415e+01 1.91962927e+02 1.97588628e-02 -1.18868541e-01 8.09187438e+01
1716.lowfreq: -5.8447 -2.1115 0.0003 0.0005 0.0006 4.9810 20.5528 43.0092 48.8011
frequency: 20.4426 42.9928 48.8003 80.7473 92.4532 121.4496 151.0092 164.3653 190.0538 201.0115 221.7809 229.1136 264.9312 270.9100 283.9834 296.8216 326.0720 374.9236 406.6194 412.4613 454.2311 458.3416 475.3039 488.4680 524.4775 526.2555 546.1398 566.0677 594.2115 633.4620 643.3268 691.9969 710.7128 740.6866 782.5855 788.9256 823.5420 825.1726 875.6777 884.0623 903.4995 907.1650 922.9621 965.0276 977.1924 977.4844 1001.2341 1010.1356 1023.7922 1078.1902 1109.8703 1111.6054 1117.0039 1129.5640 1150.3290 1151.1456 1167.5120 1182.7549 1220.0587 1242.1150 1270.9456 1279.6362 1337.5264 1340.4472 1394.0309 1398.0637 1430.6585 1437.3297 1439.4938 1453.4932 1464.1793 1466.1305 1466.5002 1474.7719 1475.5736 1520.2991 1573.1128 1575.0981 1603.4036 1611.9041 1631.5129 2956.4088 2963.9634 3042.4062 3052.7742 3123.1644 3124.5120 3125.7553 3129.1435 3162.6758 3166.8708 3171.9626 3174.5572 3177.6957 3553.1757 3702.5404
redmass: 4.5010 4.6703 5.0503 3.8707 3.2373 4.9303 4.2140 3.5403 5.2363 1.7099 1.3668 4.0750 1.6683 3.4631 6.8034 3.4192 3.6025 3.9634 1.3396 5.5352 3.0384 2.8308 5.4210 5.9163 1.0903 5.5267 5.3136 4.3633 4.5092 4.0482 6.8556 1.9826 7.1040 3.5646 5.0322 1.4984 6.1843 1.4999 1.4942 1.4349 1.5722 5.2073 5.0155 1.3418 1.3176 5.9496 4.1247 3.4683 1.6061 1.5515 1.9507 1.2609 1.2605 1.5543 1.3726 1.3263 1.4862 1.3738 5.0876 4.2181 1.4531 1.4613 2.8921 11.2717 6.5810 4.6226 1.5467 1.4006 2.0954 3.0023 1.0490 2.1855 1.0653 1.1169 1.0846 3.8632 6.9087 6.6158 1.7627 6.5904 2.4723 1.0331 1.0325 1.1037 1.1042 1.0989 1.1001 1.0895 1.0877 1.0925 1.0909 1.0942 1.0919 1.0956 1.0445 1.1044
irintensity: 0.0235 5.4664 1.8301 1.3220 10.0273 2.5076 5.4909 1.4041 0.1490 0.2250 0.4571 4.6097 0.3634 6.6577 0.7934 2.1824 2.7207 25.3611 152.3343 2.9594 5.5394 1.6990 8.8429 2.1546 128.7436 5.3561 42.6450 1.6835 2.6079 3.0240 0.3665 39.1038 24.1930 5.5498 7.6219 40.1259 5.5286 31.0750 32.1385 0.4039 41.1546 7.9012 6.4432 1.0369 1.8058 4.2556 40.0520 112.7740 3.6117 9.5473 122.4286 0.2339 0.1753 87.4863 25.7980 0.2630 46.8991 114.6460 23.4609 308.6897 4.5422 57.5499 269.4713 238.5305 25.5779 8.0549 37.6770 2.1185 9.4359 11.7837 14.0053 92.7935 14.9177 12.0459 44.0361 161.5865 123.9658 20.3042 1.5254 132.0606 586.7124 89.0098 55.0125 52.1403 44.8432 33.2719 27.5066 29.8059 14.7038 16.0463 6.1065 5.8781 2.2311 14.0041 265.9597 39.0016
temp: 298.150 k
press: 1.00000 atm
elementType: 8 8 7 7 7 6 6 6 6 6 6 6 6 6 6 6 6 6 6 1 1 1 1 1 1 1 1 1 1 1 1 1 1 1
symmnumber: 1
zpe: 698947.8 jmol-1
zpe.correction: 0.266215 hartree
zpe.thermalcorrener: 0.284112 hartree
zpe.thermalcorrenthalpy: 0.285056 hartree
zpe.thermalcorrgfe: 0.219490 hartree
zpe.sumelectzpe: -855.760191 hartree
zpe.sumelectthermal: -855.742295 hartree
zpe.sumelectthermalent: -855.741351 hartree
zpe.sumelectthermalfe: -855.806917 hartree
dipole: -2.5326 1.2726 0.0046
dipole: 2.8344
quadrupole: -57.7395 -94.6333 -117.7546
quadrupole: 6.6309 -0.0215 0.0434
quadrupole: 32.3030 -4.5908 -27.7121 6.6309 -0.0215 0.0434
hfenergy: -856.0264064 hartree
pointgroup: C01 [X(C14H15N3O2)]
dipole: 0.9819828 0.5260203 -0.0501959 debye
polarizability: 473.6950193|-21.2464846|190.6019976|-12.9219047|-2.1843861|81.4203273 unknown
InChI: InChI=1S/C14H15N3O2/c1-18-12-5-3-4-10(8-12)16-17-11-6-7-13(15)14(9-11)19-2/h3-9H,15H2,1-2H3
charge 0 multiplicity 1
34 atoms
O  5.125989 1.119633 -0.304215
O  -5.383901 -1.408958 0.122461
N  0.28808 0.347529 -0.108276
N  -0.694009 -0.524475 -0.050543
N  5.627551 -1.491269 -0.241683
C  3.984537 0.291813 -0.238116
C  4.2976 -1.108888 -0.206454
C  1.590542 -0.216389 -0.137897
C  2.656699 0.730103 -0.203926
C  3.222762 -2.042016 -0.140486
C  1.890063 -1.608713 -0.106773
C  -2.000947 0.065289 -0.020486
C  -4.405664 -0.400547 0.068785
C  -3.068824 -0.860733 0.035083
C  -2.269475 1.467257 -0.042056
C  -4.684252 0.98875 0.047692
C  -3.602671 1.906021 -0.007655
C  4.89988 2.564453 -0.345463
C  -6.784293 -0.986111 0.158593
H  2.389239 1.790534 -0.225764
H  3.455234 -3.11366 -0.116448
H  1.06049 -2.319715 -0.056396
H  -2.855635 -1.933188 0.051461
H  -1.429558 2.16558 -0.084857
H  -5.71162 1.363976 0.073062
H  -3.822389 2.979995 -0.023536
H  5.894691 -2.470624 -0.220192
H  6.343264 -0.769608 -0.288357
H  5.90091 3.017373 -0.398423
H  4.378401 2.91144 0.567368
H  4.310891 2.849105 -1.238644
H  -7.057752 -0.414931 -0.750452
H  -6.999048 -0.374788 1.057216
H  -7.365685 -1.919041 0.198278
