program: Gaussian 09
title: 000152499
version: EM64L-G09RevD.01
frameworkgroup: C1[X(C25H19N3)]
method: RPBEPBE
basis: SDD
operation: Freq
keyword: #pfreq=noraman
keyword: PBEPBE/SDD
title: #p freq=noraman PBEPBE/SDD
converged: YES YES NO NO
title: Mulliken charges:
elementType: N N N C C C C C C C C C C C C C C C C C C C C C C C C C H H H H H H H H H H H H H H H H H H H
charge: -0.059117 -0.520824 -0.520821 0.454442 0.454439 -0.057572 -0.057574 -0.481217 -0.534645 -0.534648 0.505389 0.505394 -0.408980 -0.408977 -0.482533 -0.482534 0.465768 0.465767 -0.446328 -0.373762 -0.446331 -0.373749 -0.197686 -0.220745 -0.197687 -0.220744 -0.261088 -0.261094 0.252097 0.295563 0.295561 0.233309 0.233308 0.223212 0.223215 0.298056 0.298055 0.224111 0.268629 0.224103 0.268623 0.224859 0.226171 0.224858 0.226168 0.228779 0.228779
chargesum: 0.00000
title: Mulliken charges with hydrogens summed into heavy atoms:
elementType: N N N C C C C C C C C C C C C C C C C C C C C C C C C C
charge: -0.059117 -0.222768 -0.222766 0.454442 0.454439 -0.057572 -0.057574 -0.229119 -0.239082 -0.239087 0.505389 0.505394 -0.175672 -0.175669 -0.259320 -0.259319 0.465768 0.465767 -0.222217 -0.105133 -0.222228 -0.105126 0.027173 0.005426 0.027171 0.005424 -0.032309 -0.032315
polarizability: 6.40036859e+02 4.89858543e-03 3.81015409e+02 -2.36301854e-04 4.89281448e+00 1.34831819e+02
1716.lowfreq: -4.9378 -0.0008 -0.0004 -0.0004 2.2286 5.2654 23.3020 27.2674 37.2664
frequency: 23.2533 27.2623 37.2140 38.1200 51.9846 71.6797 93.9973 101.3761 148.9561 197.8774 198.6417 203.9720 209.9707 271.0770 281.5872 288.6284 328.9217 331.1351 354.0560 407.8121 407.9226 422.8699 432.1239 439.0912 465.3896 473.3235 488.7854 489.7384 524.3414 532.9315 535.9766 580.8221 590.3549 607.7252 609.6694 615.8528 622.8697 639.0230 642.0958 652.2425 693.3549 694.5341 727.5823 739.4710 751.5201 758.2541 768.1447 785.9912 801.2456 811.7594 823.6674 825.6535 834.5824 840.1986 857.8776 860.9850 882.4906 885.0195 909.7289 911.3083 913.3170 949.9463 950.0953 957.9952 965.2109 966.0997 976.0617 983.7702 983.7907 985.9060 986.3496 1026.0694 1026.2383 1089.9212 1090.7489 1131.5408 1149.9123 1171.4406 1171.4634 1173.4119 1187.0711 1190.9786 1191.1509 1207.3235 1236.2995 1248.4273 1258.3533 1267.4911 1278.6815 1305.9094 1310.0918 1326.1374 1335.1000 1360.4286 1382.2283 1384.8993 1407.0192 1411.2384 1428.6239 1434.9175 1458.7098 1461.5178 1484.6628 1487.9040 1492.6789 1511.1421 1529.1643 1536.9206 1558.6885 1593.3290 1597.2246 1598.2247 1609.6102 1615.3951 1626.0863 1652.3943 3109.6529 3109.8768 3112.5140 3112.5261 3113.3029 3131.0621 3131.0918 3135.4727 3136.1546 3142.3678 3142.3987 3163.4646 3163.5477 3176.4772 3176.5211 3187.5465 3187.8249 3534.5645 3534.6273
redmass: 5.0196 5.0024 4.4472 4.3790 4.7453 4.9166 5.6584 4.5075 5.4051 5.0211 5.0535 4.6855 5.3175 4.2405 5.0151 5.5767 5.7675 4.1632 4.6405 2.9451 2.9181 3.7889 4.4223 4.1005 2.9396 2.8512 2.0753 2.0625 6.3111 1.6341 1.5912 6.6763 6.5135 5.8771 5.3327 5.3969 5.6652 6.7803 5.8952 3.9154 2.0188 1.9757 6.5295 3.3365 2.5952 1.7435 2.6993 1.9697 1.8960 1.6656 1.9822 1.7779 2.0493 2.5705 4.4977 3.9847 1.5633 1.6622 1.5284 1.4263 1.4038 3.3280 1.3448 1.4341 1.4230 1.3827 2.4144 5.5580 5.2088 1.3247 1.3399 2.1618 2.1639 1.5749 1.5655 1.7721 1.7481 1.0755 1.0511 1.6486 1.2554 1.1177 1.1389 2.6965 1.7092 3.6054 1.4360 1.7973 1.9265 2.3135 2.9257 1.6521 1.5905 2.4727 4.4218 5.5719 3.3777 4.7298 2.4761 3.7071 2.8496 4.5967 2.4270 2.3476 2.9224 3.9441 2.9247 2.7673 4.5005 6.1538 5.1335 4.2196 5.0733 6.0092 5.9614 6.7516 1.0864 1.0860 1.0879 1.0879 1.0917 1.0866 1.0866 1.0979 1.0978 1.0932 1.0932 1.0974 1.0974 1.0968 1.0969 1.0916 1.0917 1.0752 1.0752
irintensity: 0.1448 0.3470 2.3484 0.2527 0.9455 0.0004 3.6669 2.9543 1.5231 2.4195 0.9911 5.4053 0.4728 3.3715 6.4553 5.4619 0.5801 22.2600 3.1392 2.6636 0.0709 7.4936 7.9445 3.0567 14.4069 14.0046 119.0185 88.6626 5.7856 55.6831 62.3265 0.6516 0.5969 4.3077 0.2518 1.2364 2.7237 8.9932 9.1804 13.7627 34.4547 53.2057 0.6478 16.8317 18.7127 142.7363 1.5902 54.1363 29.3553 0.7401 1.3568 1.7929 1.1260 1.0407 6.1805 0.1740 0.8388 35.5877 25.0993 1.0443 27.4571 1.8734 0.0074 7.7309 0.4103 2.2998 14.0024 2.2693 2.2381 0.0180 0.0484 10.7981 5.3187 6.0167 10.3769 10.3732 0.3642 1.9149 0.5552 6.8033 108.8982 11.0948 8.3868 43.6562 22.9496 13.8597 0.8455 62.5654 28.2499 0.0836 254.2481 75.2125 34.8166 0.5662 91.5143 29.5674 1.5900 83.8713 1.6746 11.1475 229.4440 5.4450 119.2662 137.2280 2.2732 607.9796 389.2047 380.4020 13.6290 28.7684 269.9898 26.5260 626.7963 193.7993 315.7604 55.6025 0.9665 7.1080 4.7194 23.0647 14.4897 1.3810 1.1293 36.1411 46.3676 26.7912 30.4742 49.6751 41.2536 3.1087 4.6683 8.1464 3.1875 58.7947 9.8052
temp: 298.150 k
press: 1.00000 atm
elementType: 7 7 7 6 6 6 6 6 6 6 6 6 6 6 6 6 6 6 6 6 6 6 6 6 6 6 6 6 1 1 1 1 1 1 1 1 1 1 1 1 1 1 1 1 1 1 1
symmnumber: 1
zpe: 973283.8 jmol-1
zpe.correction: 0.370704 hartree
zpe.thermalcorrener: 0.392372 hartree
zpe.thermalcorrenthalpy: 0.393317 hartree
zpe.thermalcorrgfe: 0.318138 hartree
zpe.sumelectzpe: -1126.455423 hartree
zpe.sumelectthermal: -1126.433755 hartree
zpe.sumelectthermalent: -1126.432811 hartree
zpe.sumelectthermalfe: -1126.507989 hartree
dipole: -0.0005 -2.7023 -0.0180
dipole: 2.7023
quadrupole: -119.8810 -137.7706 -170.3711
quadrupole: -0.0010 -0.0006 2.2876
quadrupole: 22.7932 4.9036 -27.6968 -0.0010 -0.0006 2.2876
hfenergy: -1126.8261273 hartree
pointgroup: C01 [X(C25H19N3)]
dipole: -0.0002097 -1.0628262 -0.0273474 debye
polarizability: 640.0368591|-0.002336|380.7392054|0.0037847|9.5843629|135.1080224 unknown
InChI: InChI=1S/C25H19N3/c1-3-7-20(8-4-1)26-22-13-11-18-15-19-12-14-23(17-25(19)28-24(18)16-22)27-21-9-5-2-6-10-21/h1-17,26-27H
charge 0 multiplicity 1
47 atoms
N  -0.000005 -0.48328 -0.153505
N  -4.893505 -0.456487 -0.189522
N  4.893497 -0.456749 -0.189719
C  -1.225139 -2.636305 0.095401
C  1.225024 -2.636368 0.095359
C  -1.179524 -1.183765 -0.07226
C  1.179479 -1.183829 -0.072299
C  -0.000075 -3.337052 0.17693
C  -2.404999 -0.447554 -0.169455
C  2.40499 -0.447683 -0.169551
C  -3.644567 -1.098569 -0.089324
C  3.644526 -1.098764 -0.089456
C  -2.510466 -3.27786 0.155532
C  2.510317 -3.277993 0.155442
C  -3.680037 -2.539587 0.072366
C  3.679925 -2.539783 0.072236
C  -5.229858 0.914377 -0.071044
C  5.229995 0.914057 -0.071049
C  -6.444041 1.354689 -0.671486
C  -4.452209 1.847696 0.66965
C  6.444308 1.354272 -0.671309
C  4.452387 1.847414 0.669643
C  -6.866512 2.692392 -0.539975
C  -4.881718 3.186587 0.785174
C  6.866938 2.691906 -0.539632
C  4.882065 3.186236 0.78534
C  -6.084497 3.623388 0.183487
C  6.084962 3.622941 0.183823
H  -0.0001 -4.428035 0.298921
H  -2.319153 0.625905 -0.346357
H  2.319194 0.625774 -0.346481
H  -2.556025 -4.366903 0.277281
H  2.555821 -4.367039 0.277192
H  -4.654419 -3.040534 0.138485
H  4.654284 -3.040779 0.138329
H  -5.678168 -1.072368 -0.411182
H  5.678098 -1.07267 -0.411489
H  -7.048504 0.644389 -1.250313
H  -3.540934 1.526563 1.179857
H  7.048752 0.643944 -1.250123
H  3.541011 1.526367 1.179722
H  -7.803565 3.009699 -1.011177
H  -4.272288 3.891122 1.362461
H  7.804087 3.00913 -1.0107
H  4.272662 3.890796 1.362625
H  -6.407479 4.665154 0.27884
H  6.408068 4.664656 0.279308
