program: Gaussian 09
title: 000152492
version: EM64L-G09RevD.01
frameworkgroup: C1[X(C9H18Cl3N)]
method: RPBEPBE
basis: SDD
operation: Freq
keyword: #p
keyword: freq=noraman
keyword: PBEPBE/SDD
title: #p freq=noraman PBEPBE/SDD
converged: YES YES NO NO
title: Mulliken charges:
elementType: Cl Cl Cl N C C C C C C C C C H H H H H H H H H H H H H H H H H H
charge: -0.065741 -0.105320 -0.071830 -0.358411 -0.415753 -0.031729 -0.359457 -0.329530 -0.653221 -0.321264 -0.312364 -0.651407 -0.589467 0.236422 0.211224 0.232464 0.225466 0.210719 0.227787 0.191197 0.251634 0.289315 0.251995 0.260784 0.238752 0.224194 0.243057 0.233671 0.209172 0.252104 0.275538
chargesum: 0.00000
title: Mulliken charges with hydrogens summed into heavy atoms:
elementType: Cl Cl Cl N C C C C C C C C C
charge: -0.065741 -0.105320 -0.071830 -0.106777 0.027934 0.204692 0.076728 0.089453 -0.111911 -0.060480 0.150582 0.034494 -0.061825
polarizability: 1.40183031e+02 -1.77474234e+01 1.44261773e+02 2.59226320e+00 -7.04935051e+00 1.10742530e+02
1716.lowfreq: -18.1905 -13.7577 -8.5055 -4.8088 -0.0009 0.0009 0.0015 14.2870 29.5322
frequency: -15.3041 14.0437 29.4623 41.7916 64.6729 69.2762 79.5583 117.5649 128.9422 191.0940 194.0999 210.8044 219.8111 229.5314 252.9412 313.5641 328.0698 396.5890 413.9864 427.9128 457.5636 545.5040 578.7572 675.1736 690.1507 710.4158 736.6144 788.2523 824.1603 829.7953 905.2348 916.8244 958.0439 990.9900 1016.6612 1020.7296 1053.4306 1064.3286 1068.8498 1092.5601 1103.3407 1127.9608 1139.0302 1154.0752 1178.3393 1186.0102 1233.7550 1238.1644 1252.1482 1263.2564 1270.6942 1279.0638 1286.0548 1303.0529 1326.1947 1333.5484 1360.4142 1363.5160 1374.8550 1391.7703 1443.5873 1447.3329 1455.2556 1460.3036 1471.2881 1474.2606 1477.4891 1483.2198 1492.4048 2884.0473 2914.9988 2952.6716 2980.6837 2982.7597 2989.5846 3017.5896 3029.0535 3049.8531 3052.0214 3052.5872 3059.9128 3068.7071 3079.2162 3107.7297 3143.5080 3144.6723 3423.3059
redmass: 4.6518 7.7506 7.7286 2.1701 5.4204 5.3212 4.2854 2.4019 2.3703 2.9008 4.0351 2.9763 1.7967 2.3731 3.2611 2.8288 3.2543 3.5514 3.6728 3.0933 2.7972 3.5764 2.2753 5.2290 2.1966 2.6351 1.1729 1.1469 2.8278 1.3980 1.8742 1.8527 1.7969 1.5789 2.4630 1.4190 2.6715 1.7734 2.7516 2.1467 1.5647 1.3195 2.3236 2.0388 1.5817 1.5987 1.2719 1.2939 1.1572 1.1527 1.1506 1.1877 1.0991 1.3296 1.3110 1.4523 1.6150 1.4394 1.4286 1.2162 1.0787 1.1113 1.0995 1.0474 1.0739 1.0484 1.2142 1.0961 1.0830 1.0821 1.0712 1.0632 1.0622 1.0383 1.0620 1.0912 1.0974 1.0599 1.0933 1.0613 1.0986 1.0859 1.0953 1.1006 1.1071 1.1101 1.0736
irintensity: 2.2953 0.4369 0.1995 3.2467 1.6544 5.3553 0.8829 0.6173 0.5372 4.5714 3.2592 3.3887 0.1199 3.7434 1.6395 0.7963 4.8106 6.2139 6.0258 3.3737 6.7935 19.1475 32.2402 26.8292 65.8933 82.0790 4.5225 6.6177 3.6645 3.9714 11.8049 2.2269 1.5306 7.3890 3.3623 5.8811 1.9223 3.3618 7.9278 26.8579 0.4453 12.1409 35.6964 28.5954 8.4421 26.6901 10.3884 15.5226 8.0968 12.6757 7.5396 9.5577 5.2485 11.6218 4.1464 4.1259 2.5286 1.9215 6.0847 19.9436 3.8859 19.6730 7.1977 10.8901 1.7448 10.3739 20.5570 30.0601 0.1743 64.3441 66.7162 19.9113 17.4455 22.5558 37.1640 6.4401 1.6638 22.4350 8.1445 15.8188 52.2078 23.3623 36.0236 27.4312 9.9217 22.1534 1.6385
temp: 298.150 k
press: 1.00000 atm
elementType: 17 17 17 7 6 6 6 6 6 6 6 6 6 1 1 1 1 1 1 1 1 1 1 1 1 1 1 1 1 1 1
symmnumber: 1
zpe: 681578.6 jmol-1
zpe.correction: 0.259600 hartree
zpe.thermalcorrener: 0.275722 hartree
zpe.thermalcorrenthalpy: 0.276666 hartree
zpe.thermalcorrgfe: 0.211936 hartree
zpe.sumelectzpe: -1787.608588 hartree
zpe.sumelectthermal: -1787.592466 hartree
zpe.sumelectthermalent: -1787.591522 hartree
zpe.sumelectthermalfe: -1787.656252 hartree
dipole: 1.6881 -0.4500 0.8071
dipole: 1.9245
quadrupole: -114.8765 -109.9449 -100.6115
quadrupole: 15.4087 -9.7210 -4.8436
quadrupole: -6.3989 -1.4673 7.8661 15.4087 -9.7210 -4.8436
hfenergy: -1787.868188 hartree
pointgroup: C01 [X(C9H18Cl3N1)]
dipole: 0.6008737 0.3256287 -0.3258619 debye
polarizability: 133.4712974|15.4061441|151.7707102|-1.2381207|-5.2317667|109.9453264 unknown
InChI: InChI=1S/C9H18Cl3N/c1-8(12)3-2-4-9(7-11)13-6-5-10/h8-9,13H,2-7H2,1H3
charge 0 multiplicity 1
31 atoms
Cl 0.13127 -4.083449 -0.451592
Cl -3.795405 0.188093 1.482944
Cl 3.826845 3.164936 0.08053
N  2.106581 -0.575273 0.406962
C  0.034175 -0.799983 -1.023783
C  1.277964 -1.499883 -0.419912
C  -0.869482 -0.063838 -0.010128
C  -2.064721 0.62042 -0.705785
C  0.904445 -2.662351 0.520922
C  -2.985299 1.411916 0.231244
C  2.609522 0.656591 -0.239184
C  -4.117509 2.158626 -0.474407
C  3.146683 1.582417 0.858324
H  1.861991 -1.926924 -1.27178
H  0.366435 -0.093307 -1.810776
H  -0.550951 -1.581066 -1.547242
H  -1.264839 -0.771842 0.741864
H  -0.276643 0.685835 0.549797
H  -2.668476 -0.128748 -1.254749
H  -1.688221 1.341066 -1.465102
H  2.873947 -1.086413 0.866225
H  0.164748 -2.367998 1.277539
H  1.792683 -3.101955 1.003097
H  -2.407426 2.077657 0.895192
H  1.775766 1.162681 -0.753109
H  3.40228 0.474868 -1.001746
H  -4.771091 2.672317 0.24974
H  -4.734685 1.463002 -1.069014
H  -3.692181 2.918531 -1.158899
H  3.993162 1.142805 1.409473
H  2.353433 1.890969 1.553455
