program: Gaussian 09
title: 000152475
version: EM64L-G09RevD.01
frameworkgroup: C1[X(C9H11N7O5)]
method: RPBEPBE
basis: SDD
operation: Freq
keyword: #p
keyword: freq=noraman
keyword: PBEPBE/SDD
title: #p freq=noraman PBEPBE/SDD
converged: YES YES NO NO
title: Mulliken charges:
elementType: O O O O O N N N N N N N C C C C C C C C C H H H H H H H H H H H
charge: -0.267784 -0.452195 -0.437760 -0.228190 -0.201616 -0.215681 -0.061091 0.034238 0.093743 -0.084242 -0.050956 -0.399793 0.359849 -0.179635 -0.541523 0.030815 -0.350652 -0.442902 0.291399 -0.344261 0.167559 0.266533 0.259937 0.269085 0.287072 0.338770 0.235794 0.244860 0.357577 0.373467 0.374010 0.273571
chargesum: 0.00000
title: Mulliken charges with hydrogens summed into heavy atoms:
elementType: O O O O O N N N N N N N C C C C C C C C C
charge: -0.267784 -0.094617 -0.064292 -0.228190 -0.201616 -0.215681 -0.061091 0.034238 0.093743 -0.084242 -0.050956 -0.025783 0.359849 0.086898 -0.012501 0.317888 -0.011881 0.037752 0.291399 -0.070689 0.167559
polarizability: 1.94136575e+02 -2.94017464e+00 1.56080719e+02 -1.03811102e+01 8.38015619e+00 1.34474757e+02
1716.lowfreq: -2.8843 -0.0001 0.0004 0.0005 3.7683 10.0812 20.1929 38.0315 40.2459
frequency: 19.8677 38.0249 40.2404 62.7163 73.1806 103.2223 116.2637 139.6818 156.0690 162.3626 181.2056 224.0910 237.0431 251.3372 260.2817 284.1413 296.9605 333.6574 358.2417 370.7913 379.4101 435.2833 441.8080 481.6833 484.4773 498.1668 522.6792 537.2331 542.5489 595.6267 625.3870 635.7098 693.0858 704.5458 712.5805 725.7326 744.3107 765.2526 778.4282 787.0211 824.0691 851.4368 865.1659 881.8780 894.7302 933.6034 941.9754 963.5666 994.9342 1014.2897 1023.1280 1045.3173 1076.5765 1085.7039 1128.2721 1155.5951 1174.5648 1185.2657 1200.4759 1208.9671 1240.0553 1253.6224 1265.7181 1298.4943 1303.3931 1315.5060 1323.5539 1339.9455 1357.4241 1363.5293 1381.6871 1393.0166 1453.1550 1465.6402 1538.4931 1624.6940 1645.5203 1652.7753 1669.7129 3009.7904 3014.8330 3036.0206 3061.5143 3068.6988 3086.9859 3105.2981 3191.3540 3512.2640 3512.8880 3583.7772
redmass: 8.8692 7.7150 11.3759 7.7767 5.1175 8.1848 5.0409 7.1974 5.9902 8.1560 6.7708 8.1200 4.1947 5.0284 1.4030 5.0005 6.2971 4.6391 6.5140 10.5601 6.1957 6.2589 3.7360 6.4151 5.9027 5.2538 2.9681 2.6252 1.9083 5.7497 4.4347 5.9866 5.3414 3.3094 5.1257 6.3227 9.4121 12.4151 2.1039 4.7501 3.9980 2.8953 1.4308 3.1539 5.2160 2.5624 3.6147 2.8178 3.7037 3.7808 3.7328 2.9545 2.5109 1.8870 2.9665 1.2801 2.0746 2.0465 1.3202 1.4653 4.0303 1.5503 1.7099 1.3715 1.5303 2.2572 1.7264 1.2650 1.1618 1.6234 1.3628 1.5579 1.0955 1.0827 10.4433 12.3836 7.5715 12.7733 7.6444 1.0605 1.0835 1.0633 1.0835 1.0874 1.1055 1.1039 1.0935 1.0772 1.0656 1.0667
irintensity: 0.0290 0.2222 0.7639 1.2756 0.4102 0.8260 13.8993 1.6372 0.0283 7.1856 3.5119 0.5740 21.4613 4.1887 137.2517 2.1912 2.8362 16.0906 1.9118 19.0591 13.7083 2.5392 13.9350 12.9369 21.3175 10.7097 7.5432 25.1868 172.7179 17.4797 4.0577 13.4699 1.4088 21.2350 15.2048 5.4623 11.7084 16.9859 77.1398 59.8460 0.7741 32.1250 29.9864 22.5482 128.1621 27.1900 8.0916 96.2330 194.8808 8.4987 23.6473 40.1671 19.5748 39.1148 26.2415 29.1952 14.8077 33.1465 23.4550 22.1066 83.1321 50.4134 59.8269 14.8343 37.6759 126.8245 27.3792 25.6707 28.0566 1.5030 2.7979 40.1016 16.2775 10.6398 15.4505 60.8582 368.6323 50.8001 457.9654 20.3707 14.4005 13.5231 11.1077 0.9325 20.8812 6.0733 0.0679 66.5987 30.4498 15.1564
temp: 298.150 k
press: 1.00000 atm
elementType: 8 8 8 8 8 7 7 7 7 7 7 7 6 6 6 6 6 6 6 6 6 1 1 1 1 1 1 1 1 1 1 1
symmnumber: 1
zpe: 588079.6 jmol-1
zpe.correction: 0.223988 hartree
zpe.thermalcorrener: 0.243210 hartree
zpe.thermalcorrenthalpy: 0.244154 hartree
zpe.thermalcorrgfe: 0.175099 hartree
zpe.sumelectzpe: -1107.258188 hartree
zpe.sumelectthermal: -1107.238965 hartree
zpe.sumelectthermalent: -1107.238021 hartree
zpe.sumelectthermalfe: -1107.307077 hartree
dipole: 0.0468 -4.9716 3.9269
dipole: 6.3356
quadrupole: -135.1836 -133.3076 -116.9975
quadrupole: 5.9865 -2.7814 -6.3511
quadrupole: -6.6874 -4.8114 11.4987 5.9865 -2.7814 -6.3511
hfenergy: -1107.4821754 hartree
pointgroup: C01 [X(C9H11N7O5)]
dipole: 0.1663916 0.936849 2.3038527 debye
polarizability: 194.849|-9.1373565|139.7179367|-3.235118|-12.1293029|150.1251146 unknown
InChI: InChI=1S/C9H11N7O5/c10-14-7(15-11)9(3-17)4(18)1-6(21-9)16-8(20)13-5(19)2-12-16/h2,4,6-7,13,17-18H,1,3H2
charge 0 multiplicity 1
32 atoms
O  -0.386753 -0.319919 -0.055169
O  -2.211953 2.001629 1.440709
O  -2.993162 -1.890119 2.107391
O  2.050891 1.817914 -1.843366
O  5.605415 -0.993174 -0.63024
N  1.859979 0.459375 0.084367
N  -3.45257 -1.308176 -0.695558
N  -2.521624 0.805574 -1.340141
N  2.378517 -0.474914 0.962966
N  -3.555613 -1.413157 -1.919536
N  -2.772788 0.356978 -2.455519
N  3.823397 0.410461 -1.233673
C  -1.609527 -0.286791 0.778273
C  -1.405754 0.840902 1.84431
C  0.110321 1.12578 1.783681
C  0.46529 0.843464 0.314381
C  -2.847577 -0.016614 -0.127625
C  -1.707008 -1.685932 1.448126
C  2.539552 0.962568 -1.070032
C  3.59227 -0.94505 0.741374
C  4.449764 -0.552565 -0.398407
H  -1.731448 0.480733 2.838516
H  0.352197 2.158068 2.084869
H  0.664196 0.418509 2.424147
H  0.24643 1.686944 -0.36167
H  -3.630509 0.508392 0.448277
H  -0.941372 -1.758129 2.238598
H  -1.49875 -2.455656 0.681161
H  -2.18743 2.687483 2.152969
H  -3.654038 -2.133554 1.405753
H  4.349222 0.74204 -2.05037
H  3.980433 -1.675964 1.454234
