program: Gaussian 09
title: 000152471
version: EM64L-G09RevD.01
frameworkgroup: C1[X(C17H18N2O8S2)]
method: RPBEPBE
basis: SDD
operation: Freq
keyword: #p
keyword: freq=noraman
keyword: PBEPBE/SDD
title: #p freq=noraman PBEPBE/SDD
converged: YES YES NO NO
title: Mulliken charges:
elementType: S S O O O O O O O O N N C C C C C C C C C C C C C C C C C H H H H H H H H H H H H H H H H H H
charge: 0.952507 0.938322 -0.737137 -0.698357 -0.557044 -0.555296 -0.512554 -0.517318 -0.449437 -0.437446 -0.606793 -0.598388 0.288841 0.337285 -0.330549 -0.365701 -0.153995 0.320333 0.307811 0.159259 -0.299255 0.123666 -0.383156 -0.410221 -0.284630 -0.196008 -0.364337 -0.279887 -0.200426 0.285326 0.389828 0.331292 0.387567 0.373154 0.258014 0.353454 0.272287 0.278018 0.225706 0.243341 0.382100 0.237732 0.256452 0.231879 0.230137 0.370798 0.402829
chargesum: 0.00000
title: Mulliken charges with hydrogens summed into heavy atoms:
elementType: S S O O O O O O O O N N C C C C C C C C C C C C C C C C C
charge: 0.952507 0.938322 -0.383683 -0.698357 -0.557044 -0.173196 -0.512554 -0.517318 -0.078639 -0.034617 0.114327 0.162333 0.288841 0.337285 -0.330549 -0.080376 0.104019 0.320333 0.307811 0.159259 -0.026968 0.123666 -0.105138 -0.184515 -0.041289 0.041724 -0.107886 -0.048009 0.029712
polarizability: 4.35486696e+02 -3.07287372e+01 3.44455647e+02 -1.68916861e+01 -1.24301141e+01 2.06262296e+02
1716.lowfreq: -5.2352 -0.0022 -0.0015 -0.0014 0.5985 4.0345 14.7463 19.9581 24.1737
frequency: 13.9009 19.9141 24.0761 29.1386 38.8395 50.2356 60.5438 68.5673 79.0893 95.7149 106.3016 114.8703 124.6924 125.2672 134.7952 145.2698 153.6172 166.5312 175.7056 187.1675 194.6834 206.8177 209.7367 224.2151 228.8180 276.3926 277.6003 299.2991 305.4759 320.8478 324.6128 354.9828 370.8353 374.1284 381.2150 382.4034 408.4571 427.8937 435.4630 459.5450 468.4741 488.3514 497.0504 512.6097 514.0986 530.1468 531.0383 544.0345 550.4706 557.2032 578.6189 610.6099 634.5221 654.7308 705.7136 737.0463 738.6461 761.4241 766.6192 769.8431 780.3253 784.3829 792.5643 805.7379 809.3065 843.7163 849.7309 852.6422 867.1836 877.7868 901.2960 908.7725 929.1489 936.5132 950.3473 962.1806 975.1329 982.3973 987.8779 989.2563 1021.8815 1037.5895 1038.3408 1064.0462 1066.8106 1078.1100 1110.2344 1149.8186 1156.5100 1167.1562 1175.0310 1177.5963 1210.9747 1222.5193 1236.3798 1252.3207 1275.7744 1308.8643 1321.6838 1350.3885 1371.8167 1396.4001 1405.2662 1444.6185 1457.6711 1476.1248 1482.1999 1526.0966 1539.6908 1555.1133 1581.8980 1594.0400 1605.4631 1617.2155 1619.6336 1652.7756 1665.7242 2553.4371 3022.6472 3036.6848 3100.4493 3117.5706 3121.0627 3133.7340 3148.4933 3149.2441 3164.0217 3165.3402 3176.9971 3180.9423 3387.1077 3479.1575 3572.7989 3591.0774 3616.9131
redmass: 11.6626 6.1611 9.3756 6.3356 6.6311 7.6258 8.2796 7.4172 9.2176 5.2222 7.6764 4.2819 5.5214 5.4934 2.9133 5.8785 3.1419 5.6466 7.2873 7.5724 3.6064 5.0373 5.9645 6.1002 5.8535 9.1922 4.7442 10.0797 4.6180 5.3409 4.9683 4.4397 2.1882 1.7311 10.5186 9.4564 6.2507 1.3564 5.5071 4.6590 4.0318 3.8650 3.5013 5.8449 6.1376 3.4801 4.7922 5.0525 3.5281 1.3664 4.5779 6.3066 5.1197 4.3297 5.2523 3.5757 3.5811 1.2868 1.3465 2.1595 1.5239 4.1475 3.5565 2.0052 7.8460 5.0463 4.8635 1.4751 1.4100 5.2722 1.8224 6.0904 6.5119 1.1589 1.4018 1.3596 1.1688 1.3863 1.3348 1.3654 1.1609 2.2179 2.0990 1.2260 3.0071 2.4864 2.1864 1.3248 1.3553 1.1932 1.1173 1.3843 1.5726 2.0125 2.1440 2.4958 1.7125 1.6831 1.3849 2.0334 2.0448 3.2379 2.5994 2.4817 2.5120 2.5287 2.5160 3.3589 1.5015 5.3527 6.3693 5.7850 6.5539 6.3518 5.8224 1.6781 1.4693 1.0879 1.0697 1.0843 1.0704 1.0878 1.0890 1.0865 1.0896 1.0903 1.0931 1.0962 1.0984 1.0988 1.0947 1.0662 1.0670 1.0662 1.0831
irintensity: 0.7065 0.0747 0.4840 2.8798 0.5286 0.4862 1.8829 3.1236 1.1183 2.3266 6.3516 7.0779 0.2848 3.3962 27.0187 7.4203 13.9878 7.0077 2.2089 3.5364 15.0191 0.4210 3.9945 6.3308 1.5580 25.6238 28.0730 6.7196 15.9046 26.8355 15.1279 14.2644 36.0916 90.4639 99.2476 15.3800 34.4622 116.4432 26.2857 15.2904 11.2047 5.1756 43.6692 22.3314 8.8131 2.7385 67.6396 127.3276 23.6610 16.4839 11.5324 27.3345 7.5404 0.7461 3.0237 1.1988 6.3092 57.9612 71.1785 185.7174 205.4805 18.2712 43.2672 70.7318 81.6178 16.8451 6.9677 1.7204 7.8465 51.2506 67.8924 109.7356 90.4519 67.2910 5.9611 11.7207 56.1794 42.2858 0.1085 3.7565 254.8902 3.9926 4.1848 26.3565 31.4153 102.4848 9.1794 102.4993 14.9168 26.0202 6.3837 7.7357 104.9489 5.0386 255.1218 108.1247 16.6469 61.7089 56.0393 40.3345 10.1522 164.6594 56.2469 43.7018 1.5905 86.8942 14.0739 327.2515 12.2495 103.9367 54.5362 273.1543 143.4162 20.9889 83.9888 149.3636 189.0307 2281.7818 14.2618 24.5958 1638.2285 3.5617 13.6112 10.9994 5.6961 5.4792 14.2592 16.9406 28.6739 9.0783 343.0003 51.1362 16.0526 62.2082 42.2331
temp: 298.150 k
press: 1.00000 atm
elementType: 16 16 8 8 8 8 8 8 8 8 7 7 6 6 6 6 6 6 6 6 6 6 6 6 6 6 6 6 6 1 1 1 1 1 1 1 1 1 1 1 1 1 1 1 1 1 1
symmnumber: 1
zpe: 869964.3 jmol-1
zpe.correction: 0.331352 hartree
zpe.thermalcorrener: 0.362102 hartree
zpe.thermalcorrenthalpy: 0.363046 hartree
zpe.thermalcorrgfe: 0.267065 hartree
zpe.sumelectzpe: -2163.627517 hartree
zpe.sumelectthermal: -2163.596767 hartree
zpe.sumelectthermalent: -2163.595823 hartree
zpe.sumelectthermalfe: -2163.691804 hartree
dipole: 9.9905 -4.3368 -2.4361
dipole: 11.1604
quadrupole: -166.7125 -158.2926 -189.3631
quadrupole: -9.5693 -8.9049 -0.9855
quadrupole: 4.7436 13.1635 -17.9070 -9.5693 -8.9049 -0.9855
hfenergy: -2163.9588693 hartree
pointgroup: C01 [X(C17H18N2O8S2)]
dipole: 1.5003421 4.0282116 0.8954562 debye
polarizability: 344.4374347|27.1811493|398.8284864|6.4110813|87.5508764|242.9387184 unknown
InChI: InChI=1S/C17H17N2O5S.O2S.HO/c18-17(19)13(9-11-5-1-3-7-14(11)20)16(25(22,23)24)10-12-6-2-4-8-15(12)21;1-3-2;/h1-10,20-22H,18-19H2;;1H
charge 0 multiplicity 1
47 atoms
S  2.612883 -3.033568 -2.761812
S  -0.992344 -0.672108 2.331286
O  3.810199 -2.65536 -1.027379
O  1.406282 -1.941176 -2.404533
O  2.123508 -4.55823 -2.520202
O  0.071744 0.486364 3.332952
O  -0.427141 -2.181541 2.581524
O  -2.522528 -0.341599 2.757741
O  2.529365 4.251837 1.125436
O  -1.038905 -2.231851 -2.995254
N  3.187219 -0.156185 -0.375133
N  1.982272 -1.805008 0.732698
C  2.096573 -0.525814 0.341084
C  1.011343 0.46089 0.630426
C  -0.342957 -0.124603 0.576437
C  1.346226 1.78194 0.852039
C  -0.902868 -0.676548 -0.550475
C  0.495486 2.942032 1.080367
C  -2.103145 -1.424885 -0.885579
C  1.129132 4.221424 1.220199
C  -0.928588 2.908295 1.167535
C  -2.107408 -2.140911 -2.145628
C  -3.299975 -1.428898 -0.098132
C  0.378655 5.398392 1.433248
C  -1.682964 4.075883 1.373146
C  -1.027579 5.32454 1.509477
C  -3.295908 -2.794017 -2.57499
C  -4.456204 -2.089078 -0.534737
C  -4.452874 -2.771041 -1.782727
H  2.419525 2.014977 0.873989
H  3.800818 -0.941767 -0.707195
H  3.178927 0.734313 -0.86911
H  2.644581 -2.48473 0.283327
H  1.201595 -2.112855 1.332664
H  -0.251405 -0.485975 -1.422918
H  4.516355 -3.35304 -1.028565
H  -1.441134 1.948544 1.070756
H  -3.333899 -0.877868 0.846071
H  0.887262 6.365278 1.537453
H  -2.773531 4.017014 1.43633
H  -0.314765 0.455841 4.25622
H  -1.609015 6.237497 1.676084
H  -3.262193 -3.322092 -3.532124
H  -5.361321 -2.066314 0.080221
H  -5.356471 -3.285331 -2.129191
H  2.878089 5.168026 1.254081
H  -0.058118 -2.137892 -2.640605
