program: Gaussian 09
title: 000152470
version: EM64L-G09RevD.01
frameworkgroup: C1[X(C17H28O2)]
method: RPBEPBE
basis: SDD
operation: Freq
keyword: #pfreq=noraman
keyword: PBEPBE/SDD
title: #p freq=noraman PBEPBE/SDD
converged: YES YES NO NO
title: Mulliken charges:
elementType: O O C C C C C C C C C C C C C C C C C H H H H H H H H H H H H H H H H H H H H H H H H H H H H
charge: -0.417506 -0.233489 -0.524576 -0.485296 -0.558510 0.476442 0.403083 -0.316866 -0.465054 -0.296404 -0.460575 -0.843721 -0.827651 -0.250491 -0.475575 0.369884 -0.794781 -0.788819 0.180334 0.195038 0.224328 0.206534 0.202914 0.212302 0.200291 0.217262 0.207354 0.207250 0.220288 0.225172 0.221581 0.219426 0.236717 0.223480 0.230686 0.221689 0.226546 0.200581 0.253760 0.266416 0.222190 0.223459 0.216710 0.209886 0.218330 0.224525 0.374855
chargesum: 0.00000
title: Mulliken charges with hydrogens summed into heavy atoms:
elementType: O O C C C C C C C C C C C C C C C C C
charge: -0.042650 -0.233489 -0.105210 -0.075848 -0.145917 0.476442 0.403083 -0.099604 -0.050451 -0.076116 -0.013823 -0.164097 -0.148729 -0.049909 0.044601 0.369884 -0.132422 -0.136078 0.180334
polarizability: 2.12549924e+02 8.15825291e+00 1.98833628e+02 4.24004994e-01 7.82042897e+00 1.65569525e+02
1716.lowfreq: -3.0521 -0.0006 -0.0005 0.0001 1.5686 6.8259 11.3801 14.8363 21.7439
frequency: 11.0731 14.0984 21.4097 25.5343 30.9192 42.7726 47.6574 59.0928 64.7890 71.2241 94.9157 118.2658 127.4502 140.5212 165.5221 183.4266 194.3552 203.2139 228.9865 274.9671 292.0780 300.1377 321.8304 350.3878 384.3446 401.2936 415.7466 421.7701 450.4016 466.0647 486.6583 498.5890 503.2674 515.1244 551.0846 571.7709 590.8152 639.2629 724.5846 738.5072 778.4161 794.1787 810.5910 830.1920 846.5945 863.5207 885.2217 901.0472 922.3993 930.8365 948.0576 978.5268 985.5991 993.2813 994.7742 1005.6693 1022.9419 1028.8687 1035.3766 1039.8071 1048.1788 1077.9562 1081.2474 1096.2462 1107.4537 1118.9467 1145.8696 1153.4437 1162.4499 1194.2999 1199.5683 1222.0740 1231.1923 1237.9944 1243.9437 1270.9771 1289.0780 1297.8847 1305.2416 1327.6684 1329.5807 1359.6271 1364.3095 1374.0000 1375.9092 1386.9734 1395.7764 1397.1704 1398.6372 1436.1545 1453.5137 1454.9607 1455.5901 1459.2766 1459.9340 1463.6919 1466.7803 1470.2478 1471.9786 1474.4308 1475.9478 1478.9924 1482.9888 1667.2505 1687.0639 1689.4030 1696.3225 2948.0572 2952.2811 2955.1060 2961.0234 2961.7129 2964.4067 2964.4920 2977.8874 2980.0005 2991.0072 3018.9207 3022.9552 3028.4657 3029.4474 3031.3439 3032.9188 3040.3396 3042.1992 3042.7583 3060.6152 3066.3746 3073.1208 3077.1459 3082.1834 3086.0380 3089.8121 3092.0719 3510.4445
redmass: 8.7451 5.0535 3.6160 3.1570 3.1157 3.2074 3.1129 2.8867 2.5185 2.9338 2.1162 1.1378 1.2375 1.5616 1.8308 1.4905 3.3864 3.3178 1.9076 2.7006 2.1036 3.1378 2.3996 2.4192 2.3849 2.3286 3.0143 2.4895 2.7296 2.4663 2.5435 2.0126 2.4266 2.6188 2.1942 2.3937 4.1295 1.3116 2.2726 1.8786 2.1400 1.9468 1.4911 1.5577 1.6199 3.0667 1.8643 1.8730 1.8653 1.9104 1.3846 2.0341 1.7511 1.5593 1.4280 2.3230 3.4064 1.7172 1.5873 1.5523 1.7896 2.4299 1.6608 1.9040 2.3456 2.0940 1.5760 1.3294 1.3491 1.3317 1.2011 1.8205 2.0812 1.5106 1.5878 1.1379 1.5848 1.2998 1.3575 1.4273 1.5110 1.7331 1.4374 1.3422 1.4536 1.3020 1.3115 1.2740 1.2610 1.0823 1.0749 1.0618 1.0757 1.0876 1.0854 1.0937 1.0630 1.0600 1.0460 1.0689 1.0763 1.0680 1.0788 8.2017 6.7986 6.9182 6.5541 1.0629 1.0372 1.0622 1.0443 1.0392 1.0470 1.0529 1.0621 1.0658 1.0633 1.0965 1.0966 1.0965 1.0964 1.0965 1.0963 1.0927 1.0945 1.0970 1.0944 1.0920 1.0953 1.0916 1.0916 1.0941 1.0957 1.0952 1.0639
irintensity: 1.1573 0.0039 0.0765 0.0705 0.0982 0.0672 0.0172 0.1030 0.9000 0.2999 0.5717 0.4660 0.8732 0.1971 0.5872 1.5096 3.8459 0.5005 0.5212 0.0564 0.4530 2.1515 0.6712 0.5121 1.6450 0.8179 9.2793 8.1082 3.0708 1.3755 6.4157 23.5885 8.4182 29.7092 6.7473 13.5532 11.7228 125.2396 5.8085 13.9930 2.7175 5.2225 6.8089 12.8185 15.7151 5.0138 19.3570 6.7557 0.6393 10.7260 0.2338 7.5872 5.4064 3.9636 2.7163 2.0134 175.8116 6.2354 3.7965 3.1968 5.2799 112.2003 4.0722 13.0814 14.2626 9.1555 4.6310 2.3958 6.1306 1.7825 1.8351 1.5736 3.6976 2.7319 3.0272 1.3900 34.3688 1.7622 0.0320 1.8147 0.8587 57.1124 2.2442 1.8622 2.1645 22.7211 12.4661 11.3688 34.4636 22.5585 11.9450 1.1147 1.1923 4.5472 1.6811 18.2644 13.7598 8.9048 33.6564 20.1258 24.9620 9.0893 10.1800 202.8753 3.6543 6.1919 2.7264 17.8343 40.0253 39.9438 78.7884 8.9272 76.6046 42.7540 64.9408 9.3755 13.2743 6.9772 20.9096 47.6533 15.0656 34.3850 29.7223 2.6102 10.1492 58.3391 4.9670 10.4183 96.9487 20.3440 25.5108 44.1756 35.4986 40.0808 16.8992
temp: 298.150 k
press: 1.00000 atm
elementType: 8 8 6 6 6 6 6 6 6 6 6 6 6 6 6 6 6 6 6 1 1 1 1 1 1 1 1 1 1 1 1 1 1 1 1 1 1 1 1 1 1 1 1 1 1 1 1
symmnumber: 1
zpe: 1069827.4 jmol-1
zpe.correction: 0.407476 hartree
zpe.thermalcorrener: 0.431629 hartree
zpe.thermalcorrenthalpy: 0.432573 hartree
zpe.thermalcorrgfe: 0.347789 hartree
zpe.sumelectzpe: -813.511469 hartree
zpe.sumelectthermal: -813.487316 hartree
zpe.sumelectthermalent: -813.486372 hartree
zpe.sumelectthermalfe: -813.571156 hartree
dipole: 0.8907 -0.2407 -1.7122
dipole: 1.9449
quadrupole: -113.5928 -112.8689 -122.5636
quadrupole: 0.5076 3.7905 -0.0305
quadrupole: 2.7490 3.4729 -6.2219 0.5076 3.7905 -0.0305
hfenergy: -813.918945 hartree
pointgroup: C01 [X(C17H28O2)]
dipole: 0.3032164 -0.0617569 -0.6998292 debye
polarizability: 213.1210845|8.1577081|197.0223731|-1.6779475|9.4539073|166.8096203 unknown
InChI: InChI=1S/C17H28O2/c1-14(2)8-5-9-15(3)10-6-11-16(4)12-7-13-17(18)19/h8,10,12,18H,5-7,9,11,13H2,1-4H3
charge 0 multiplicity 1
47 atoms
O  -5.679909 -1.17402 -0.240163
O  -4.860656 -0.514443 1.829045
C  0.5585 2.423757 -1.204085
C  1.870518 2.751582 -0.410927
C  3.432305 -0.365666 1.471577
C  3.224163 0.701258 0.401055
C  -0.68224 2.260585 -0.330311
C  2.255413 1.650594 0.555777
C  3.21822 -1.830999 0.973111
C  -1.263912 1.033515 -0.193607
C  -2.475247 0.652322 0.632128
C  4.145891 0.605901 -0.802636
C  -1.171763 3.526514 0.352054
C  1.8023 -2.089809 0.499459
C  -3.5305 -0.087287 -0.222959
C  1.389359 -2.716982 -0.639591
C  2.316578 -3.294966 -1.695612
C  -0.092293 -2.894436 -0.938596
C  -4.709447 -0.584316 0.58968
H  0.387711 3.245362 -1.932318
H  0.729983 1.497657 -1.784352
H  1.728256 3.701522 0.14265
H  2.675507 2.937763 -1.146174
H  2.745763 -0.175626 2.319581
H  4.466477 -0.294007 1.871606
H  1.636299 1.594427 1.464239
H  3.955765 -2.068735 0.185078
H  3.450703 -2.506282 1.824366
H  -0.793206 0.194512 -0.731729
H  -2.172562 -0.015093 1.464632
H  -2.941917 1.531653 1.108788
H  5.198702 0.479086 -0.481716
H  3.892234 -0.275493 -1.424854
H  4.093539 1.494287 -1.453521
H  -0.441549 3.880165 1.106888
H  -1.285742 4.346325 -0.384106
H  -2.137494 3.393468 0.866339
H  1.021645 -1.714937 1.181825
H  -3.080173 -0.961853 -0.733955
H  -3.913481 0.562956 -1.031927
H  2.169176 -4.389813 -1.787346
H  3.382959 -3.118813 -1.47933
H  2.091915 -2.863236 -2.69151
H  -0.366113 -2.409705 -1.898084
H  -0.353502 -3.96675 -1.042608
H  -0.723774 -2.46591 -0.1401
H  -6.436497 -1.495136 0.322438
