program: Gaussian 09
title: 000152460
version: EM64L-G09RevD.01
frameworkgroup: C1[X(C14H13NOS)]
method: RPBEPBE
basis: SDD
operation: Freq
keyword: #p
keyword: freq=noraman
keyword: PBEPBE/SDD
title: #p freq=noraman PBEPBE/SDD
converged: YES YES NO NO
title: Mulliken charges:
elementType: S O N C C C C C C C C C C C C C C H H H H H H H H H H H H H
charge: 0.152509 -0.274836 -0.454243 0.264683 -0.333595 0.133360 0.478010 -0.323564 -0.160655 -0.237074 -0.250826 -0.345140 -0.448058 -0.214843 -0.198131 -0.255664 -0.849173 0.309651 0.284083 0.234120 0.237714 0.234147 0.309719 0.223999 0.225260 0.223866 0.227331 0.277062 0.262779 0.267509
chargesum: 0.00000
title: Mulliken charges with hydrogens summed into heavy atoms:
elementType: S O N C C C C C C C C C C C C C C
charge: 0.152509 -0.274836 -0.144592 0.264683 -0.333595 0.133360 0.478010 -0.039481 0.073465 0.000639 -0.016679 -0.035421 -0.224059 0.010417 0.025735 -0.028333 -0.041823
polarizability: 2.82410529e+02 1.28485138e+01 2.04625085e+02 -7.89732902e+00 5.35983648e+00 8.02592619e+01
1716.lowfreq: -8.6355 -3.9019 -1.8722 0.0019 0.0021 0.0021 11.7701 39.4149 50.1369
frequency: 9.0194 39.4014 50.1206 69.7757 97.2974 119.1058 165.4923 188.4494 204.7539 226.3424 246.0652 278.2053 319.7758 350.6131 403.4932 408.0391 425.7286 486.3170 498.1964 518.9236 574.1142 615.1357 639.3014 658.9734 678.0275 695.1781 698.5590 733.6222 746.0117 772.9101 778.4642 816.9951 845.8967 866.6068 876.7913 920.2219 964.9003 968.4532 973.7753 984.3641 988.6894 1000.2849 1001.0372 1019.5605 1024.9632 1044.5819 1085.7643 1109.3709 1122.0839 1171.5936 1177.0413 1186.3593 1227.4941 1266.9997 1269.8983 1320.6534 1347.2011 1360.9122 1386.1943 1415.7111 1433.8050 1445.9389 1449.5852 1468.0194 1484.9267 1532.9467 1561.8675 1586.6121 1598.1845 1612.7907 1615.1573 3014.7887 3114.5361 3131.0632 3134.0528 3135.7086 3142.8301 3143.3400 3150.6661 3161.8794 3163.9622 3172.8617 3198.8810 3379.3018
redmass: 3.7402 5.7979 4.0939 5.2243 5.4570 4.2201 3.1976 1.5216 3.3833 3.5658 5.9298 4.5841 5.3269 8.2386 7.9980 3.1165 3.6683 5.0628 4.3949 3.0950 6.3859 6.4515 6.3835 7.0870 4.6027 1.8705 5.6690 1.3710 2.0302 1.5719 1.8866 5.4359 1.2722 5.9415 1.4518 1.4392 1.3422 1.2047 1.3481 5.9356 1.2784 1.3545 1.3093 6.9853 2.3516 2.8676 1.5878 2.3157 1.8122 1.0528 1.0653 1.1157 2.6819 1.6293 2.0867 1.4758 1.1360 9.5781 6.8917 2.0725 2.3786 1.0834 1.9265 1.1338 2.4426 2.4758 5.1424 7.1256 6.1725 2.9133 6.0343 1.0284 1.0877 1.0872 1.0946 1.0953 1.1051 1.0938 1.0897 1.0939 1.1000 1.1003 1.0948 1.0786
irintensity: 0.1316 2.5165 0.1985 0.8081 5.2071 0.3051 0.0294 1.5663 2.8351 1.6145 0.2039 1.4581 4.7566 5.8534 8.1022 1.0489 1.3069 6.1653 13.7521 13.1187 10.3419 0.8733 1.8732 0.7434 7.1312 28.5623 6.1348 31.3738 44.5172 157.6383 14.9555 0.8913 1.2921 13.5542 1.2892 14.5723 1.6635 4.6890 0.3692 0.8056 11.9340 0.9293 3.8859 26.5578 4.7265 15.1642 12.1189 4.6462 16.0677 0.5808 2.1478 0.7101 28.9692 52.3386 30.2812 53.4851 1.7906 1.0085 53.5377 5.3640 67.2687 14.2182 32.1596 8.7614 93.5958 370.5944 16.8973 108.0939 70.4391 66.8581 29.5382 23.4499 12.7219 0.7974 7.4674 3.0307 10.6262 32.5619 7.3246 8.5864 32.3980 28.8296 8.0595 163.8167
temp: 298.150 k
press: 1.00000 atm
elementType: 16 8 7 6 6 6 6 6 6 6 6 6 6 6 6 6 6 1 1 1 1 1 1 1 1 1 1 1 1 1
symmnumber: 1
zpe: 611731.5 jmol-1
zpe.correction: 0.232996 hartree
zpe.thermalcorrener: 0.248466 hartree
zpe.thermalcorrenthalpy: 0.249410 hartree
zpe.thermalcorrgfe: 0.187566 hartree
zpe.sumelectzpe: -1068.139881 hartree
zpe.sumelectthermal: -1068.124411 hartree
zpe.sumelectthermalent: -1068.123467 hartree
zpe.sumelectthermalfe: -1068.185311 hartree
dipole: -3.1744 4.0277 1.8115
dipole: 5.4388
quadrupole: -85.9034 -97.7136 -114.1381
quadrupole: -1.3818 -2.4539 1.2775
quadrupole: 13.3483 1.5381 -14.8864 -1.3818 -2.4539 1.2775
hfenergy: -1068.3728772 hartree
pointgroup: C01 [X(C14H13N1O1S1)]
dipole: -1.1360456 1.414702 1.1343445 debye
polarizability: 283.1668901|11.2083105|192.8187489|-9.9555581|34.8685262|91.3092368 unknown
InChI: InChI=1S/C14H13NOS/c1-17-13-10-6-5-9-12(13)14(16)15-11-7-3-2-4-8-11/h2-10,15H,1H3
charge 0 multiplicity 1
30 atoms
S  -1.317272 2.198184 0.032902
O  0.249103 -2.01396 -0.937546
N  0.800929 -0.017279 0.150184
C  -1.586044 -0.664451 -0.116281
C  -2.242233 0.587767 0.102382
C  -0.105473 -0.940861 -0.35289
C  2.222558 -0.046111 0.082781
C  -2.389827 -1.83914 -0.140899
C  -3.644535 0.624196 0.302797
C  -3.779196 -1.801682 0.072373
C  -4.410247 -0.559353 0.303418
C  2.962598 -1.089917 -0.537396
C  2.91379 1.045126 0.680481
C  4.372785 -1.022784 -0.550423
C  4.321182 1.095558 0.658288
C  5.062354 0.059873 0.041649
C  -2.330988 3.292757 1.18337
H  0.400909 0.818614 0.598893
H  -1.871817 -2.782002 -0.342443
H  -4.153388 1.582465 0.442717
H  -4.362335 -2.727965 0.055404
H  -5.492433 -0.503298 0.463904
H  2.427798 -1.924641 -0.992539
H  2.344277 1.852164 1.15895
H  4.936329 -1.830664 -1.030918
H  4.83873 1.942841 1.121834
H  6.1568 0.097646 0.024202
H  -2.570326 2.74753 2.108598
H  -3.246204 3.644086 0.684725
H  -1.683424 4.153901 1.409885
