program: Gaussian 09
title: 000152459
version: EM64L-G09RevD.01
frameworkgroup: C1[X(C8H14O4)]
method: RPBEPBE
basis: SDD
operation: Freq
keyword: #pfreq=noraman
keyword: PBEPBE/SDD
title: #p freq=noraman PBEPBE/SDD
converged: YES YES NO NO
title: Mulliken charges:
elementType: O O O O C C C C C C C C H H H H H H H H H H H H H H
charge: -0.412075 -0.237963 -0.417579 -0.228557 -0.103912 -0.414043 -0.373455 -0.394810 -0.487001 0.140108 -0.699496 0.171487 0.235866 0.220704 0.198812 0.233891 0.219975 0.205293 0.223282 0.257620 0.250408 0.228869 0.215146 0.218480 0.372596 0.376356
chargesum: 0.00000
title: Mulliken charges with hydrogens summed into heavy atoms:
elementType: O O O O C C C C C C C C
charge: -0.039479 -0.237963 -0.041224 -0.228557 0.131954 0.005473 0.080410 0.033765 0.021026 0.140108 -0.037001 0.171487
polarizability: 1.14206363e+02 1.16672650e-01 9.63861943e+01 2.39993877e+00 -5.35162452e+00 8.25642173e+01
1716.lowfreq: -13.3845 -0.0006 0.0002 0.0005 3.7103 8.0373 15.7025 32.1000 38.6207
frequency: 14.5671 32.0757 38.3249 66.5504 74.0242 89.6510 105.4055 164.1401 177.7893 228.4120 246.3485 269.3806 334.4763 394.4963 468.9632 488.9069 500.8274 581.6360 592.1485 626.7764 636.2809 715.6338 731.0828 747.0773 809.2391 860.5085 875.6412 914.0207 1006.0976 1012.7373 1032.9636 1044.1413 1069.9871 1079.3658 1094.2836 1106.1532 1125.7401 1157.1589 1230.5850 1235.9667 1250.0836 1266.2369 1269.8967 1295.5290 1301.1212 1329.7468 1347.0586 1376.5808 1379.3217 1395.9026 1437.8225 1456.7374 1465.9827 1475.8644 1478.0769 1483.0298 1658.3865 1671.2909 2974.9448 2979.9349 2985.1286 2987.8658 2999.8718 3018.6539 3027.3931 3035.8135 3046.7736 3067.1479 3078.0425 3079.4637 3496.0804 3514.5994
redmass: 10.0500 9.4953 4.4609 3.9694 2.0237 2.2104 2.8685 2.9534 2.6344 1.6478 4.4671 2.1704 4.4992 3.3214 4.0077 3.5014 1.7735 3.8142 3.8512 1.2669 1.3283 2.0137 2.0607 1.5401 1.5245 4.1393 1.5923 2.1211 3.1648 2.2898 2.1020 2.3825 2.4114 2.1651 2.4002 1.8522 2.2599 1.4175 1.3429 1.5052 1.3524 1.3075 1.2777 1.0945 1.3720 1.4071 1.5379 1.7747 1.6897 1.2123 1.0852 1.0763 1.0770 1.0911 1.0560 1.0494 7.8428 8.2739 1.0594 1.0358 1.0600 1.0610 1.0597 1.0910 1.0962 1.1008 1.0982 1.1032 1.0998 1.1004 1.0637 1.0640
irintensity: 1.1790 2.8538 0.0045 0.0436 0.2485 0.3334 0.1855 0.7681 0.9201 0.7819 1.7556 2.2445 3.7646 2.2511 41.2046 22.4566 30.3084 12.0313 18.2189 103.2293 127.6948 37.5617 29.1302 7.7873 8.1499 0.5253 1.0650 12.1523 51.0231 116.7176 123.9296 128.8154 91.2124 6.4165 27.1429 3.7183 24.8029 11.0476 8.6312 0.2868 1.5466 10.3185 9.2792 1.4272 22.3823 3.1943 29.6289 21.0143 23.8937 13.2117 24.8149 0.3837 8.3686 15.6275 17.7508 13.6108 175.9322 204.8129 11.1766 33.9934 30.5820 4.4740 31.1180 4.7648 3.0808 0.1390 6.9773 43.8688 51.5894 58.9186 18.8337 19.4694
temp: 298.150 k
press: 1.00000 atm
elementType: 8 8 8 8 6 6 6 6 6 6 6 6 1 1 1 1 1 1 1 1 1 1 1 1 1 1
symmnumber: 1
zpe: 559911.8 jmol-1
zpe.correction: 0.213259 hartree
zpe.thermalcorrener: 0.227511 hartree
zpe.thermalcorrenthalpy: 0.228455 hartree
zpe.thermalcorrgfe: 0.168827 hartree
zpe.sumelectzpe: -613.206506 hartree
zpe.sumelectthermal: -613.192254 hartree
zpe.sumelectthermalent: -613.191310 hartree
zpe.sumelectthermalfe: -613.250938 hartree
dipole: -0.1698 -1.7131 -0.6837
dipole: 1.8523
quadrupole: -65.6076 -69.4393 -79.1935
quadrupole: -2.1622 4.5174 2.2429
quadrupole: 5.8058 1.9741 -7.7800 -2.1622 4.5174 2.2429
hfenergy: -613.4197647 hartree
pointgroup: C01 [X(C8H14O4)]
dipole: -0.065303 0.6823005 0.2475442 debye
dipolederiv: -0.4180028 -0.0652633 0.0932024 -0.0814668 -0.7723604 0.5279426 0.0814523 0.4277247 -0.6388664 -0.3682799 -0.055278 -0.047419 -0.0722147 -0.6068019 -0.1871903 -0.0013737 0.0514422 -0.9035419 -1.1542322 -0.3908999 0.3096911 -0.321336 -0.4535341 0.0462775 0.2775761 0.0530855 -0.4913293 -0.6852428 0.1088201 -0.0411076 -0.0962576 -0.7619548 0.3113016 0.099591 0.2883605 -0.4976598 -0.1061663 -0.0000664 0.0130017 -0.0007527 -0.2267289 -0.0501844 0.0007424 -0.002341 0.0835261 0.0677586 0.0683829 0.0292698 0.0344594 0.1159644 0.0278563 -0.0113478 -0.0245592 0.1134226 0.0212542 0.0098403 0.0136543 -0.0024447 0.0571601 0.0440242 0.0273094 0.049146 0.1249664 0.1012263 -0.0962646 -0.0200843 -0.0686405 0.1480609 0.032312 0.0295997 -0.0357345 0.1064861 -0.2186358 0.1050499 -0.0350028 0.2726578 -0.0517307 0.1180055 -0.144808 0.1267708 0.079618 0.2374416 0.1972384 -0.0047466 0.2326784 1.2583818 -0.1585554 -0.0275667 -0.2506555 1.2537224 -0.0808568 -0.0081691 0.0376023 0.016666 0.0483265 0.0119721 0.0232792 0.0206795 0.0783044 1.5582831 0.0972707 -0.1817808 0.1337544 0.9692995 -0.5263634 -0.2226755 -0.5157759 0.5420011 0.0527801 0.0009205 -0.0127096 -0.0050558 0.0445837 0.0254998 -0.0130974 0.016385 -0.1125543 0.0425378 0.0083941 -0.0178192 0.0141674 0.0748509 0.0060488 0.0019091 0.0506424 -0.1224191 0.0311513 -0.0423116 -0.0098142 -0.0185797 -0.1567223 -0.0673093 -0.0031223 -0.0729999 0.0490228 0.0590336 -0.0235116 -0.0071232 -0.0374572 -0.1051214 -0.0566943 0.0052662 -0.0654508 0.0407921 0.0474591 0.0012423 0.0099603 -0.0131372 0.0698573 0.0157108 -0.0073799 0.0219712 -0.1301796 0.0098591 -0.0556414 -0.0148339 -0.0533848 -0.1538888 -0.0669844 -0.0225308 -0.0721946 0.0570199 0.0330604 0.0067335 0.0337733 0.0072325 0.0766751 0.0042539 -0.0004868 0.0599847 -0.1349937 0.0649463 0.0166417 -0.0091073 -0.0174002 0.1075189 0.004497 0.0342261 0.0229033 -0.0783362 0.0532198 -0.0056449 -0.011187 -0.0571296 -0.0621912 -0.0497022 0.0005517 -0.0745409 0.0863499 0.0707064 -0.0488213 -0.0032614 -0.0948839 -0.1050333 -0.0729973 -0.0185731 -0.0891984 0.0398229 0.0700999 -0.0077662 -0.0440997 -0.0222848 0.0868997 0.0330038 0.0263278 0.0253232 -0.1620713 -0.1106895 0.1226668 -0.0126088 0.1497742 -0.0208759 0.0303509 -0.0299853 0.0420946 0.0864017 0.3873738 -0.0323382 -0.0258742 -0.0323819 0.2022193 -0.1008071 -0.0348113 -0.1547876 0.2000891 0.2339146 0.0887755 -0.0415754 0.1334181 0.2171455 0.0977314 -0.0700725 0.1017247 0.3304059 unknown
polarizability: 114.1231756|-0.2238377|96.0142801|-2.8750586|-5.804633|83.0193184 unknown
InChI: InChI=1S/C8H14O4/c1-2-6(8(11)12)4-3-5-7(9)10/h6,9,11H,2-5H2,1H3
charge 0 multiplicity 1
26 atoms
O  -2.036839 -1.95321 0.7005
O  -1.955784 -1.202873 -1.492961
O  4.650964 0.594427 -0.429213
O  3.539276 -1.066693 0.751762
C  -1.627736 0.415692 0.351863
C  -0.283836 0.986781 -0.180435
C  0.948786 0.147907 0.220423
C  -2.813206 1.367144 0.013785
C  2.253629 0.773982 -0.305612
C  -1.881639 -0.950381 -0.268982
C  -4.168411 0.90648 0.589995
C  3.489587 -0.014992 0.078701
H  -1.568149 0.28295 1.447992
H  -0.347338 1.061506 -1.284323
H  -0.175608 2.018549 0.210623
H  0.856553 -0.881149 -0.175081
H  1.002147 0.049958 1.321364
H  -2.561305 2.369534 0.411927
H  -2.883491 1.463337 -1.087018
H  2.236365 0.860355 -1.409844
H  2.38273 1.808122 0.070915
H  -4.481083 -0.064401 0.164022
H  -4.119223 0.791479 1.68865
H  -4.961064 1.641213 0.360042
H  -2.198306 -2.82613 0.246831
H  5.444379 0.054711 -0.162826
