program: Gaussian 09
title: 000152454
version: EM64L-G09RevD.01
frameworkgroup: C1[X(C16H16NO6P)]
method: RPBEPBE
basis: SDD
operation: Freq
keyword: #p
keyword: freq=noraman
keyword: PBEPBE/SDD
title: #p freq=noraman PBEPBE/SDD
converged: YES YES NO NO
title: Mulliken charges:
elementType: P O O O O O O N C C C C C C C C C C C C C C C C H H H H H H H H H H H H H H H H
charge: 1.260032 -0.481508 -0.536730 -0.594980 -0.235067 -0.213054 -0.217485 0.021328 -0.398887 0.302024 0.136542 -0.882171 0.349643 0.445564 -0.337838 -0.345947 -0.419364 -0.349060 -0.306499 -0.345275 0.379052 -0.343287 -0.333956 -0.799155 0.240960 0.269563 0.273013 0.320453 0.276433 0.238141 0.275588 0.240396 0.239644 0.316530 0.268388 0.288826 0.289224 0.236848 0.241494 0.230576
chargesum: 0.00000
title: Mulliken charges with hydrogens summed into heavy atoms:
elementType: P O O O O O O N C C C C C C C C C C C C C C C C
charge: 1.260032 -0.481508 -0.536730 -0.594980 -0.235067 -0.213054 -0.217485 0.021328 0.111636 0.302024 0.136542 -0.012272 0.349643 0.445564 -0.099697 -0.070358 -0.178968 -0.109416 0.010031 -0.076887 0.379052 -0.054461 -0.044732 -0.090237
polarizability: 2.39464552e+02 8.87222377e+00 2.94129678e+02 3.88072809e+01 -6.98625204e+00 1.69542152e+02
1716.lowfreq: -28.5170 -7.0312 -2.0416 -0.0004 0.0009 0.0011 5.0303 7.2791 19.0597
frequency: -28.3561 7.1091 18.4647 22.1263 35.4843 45.2685 69.1129 72.9438 98.4436 103.7865 109.3622 133.4284 157.0920 165.4033 181.7548 198.3681 203.8970 228.2701 262.5423 269.4059 292.7731 294.2435 323.3727 341.3763 346.3926 388.7384 399.5741 417.0820 438.4652 454.7669 462.7313 493.7837 502.8490 549.1577 559.8451 579.1782 609.6673 624.0232 632.7871 660.3808 667.3029 721.9863 726.8795 733.6559 757.6671 778.1935 805.7995 819.8954 835.9032 840.6149 859.8622 873.2566 943.2938 955.1283 957.0111 966.5653 983.2381 984.3659 988.4608 998.2927 999.8367 1002.1123 1012.2183 1048.2070 1053.9841 1067.5527 1093.7196 1107.8356 1126.2782 1168.8653 1194.8266 1208.8020 1223.8639 1224.6573 1226.8466 1243.2458 1293.5396 1311.3314 1330.3604 1336.7896 1355.8243 1374.7285 1395.2401 1399.0051 1415.6559 1424.6437 1429.3077 1433.5529 1445.4323 1467.8201 1470.3934 1472.7111 1504.9051 1565.8385 1587.0032 1598.3066 1602.8079 1623.4598 2980.7941 2981.2682 3023.2239 3059.8055 3060.2293 3091.9917 3128.1053 3129.6127 3145.6977 3150.5535 3158.8737 3159.4892 3159.6963 3169.0797 3183.9006 3189.8208
redmass: 1.0275 6.9839 5.1620 4.9322 5.7471 5.3780 6.7946 6.7823 7.0014 5.4492 5.5237 4.2313 1.3375 2.4490 5.7196 4.9251 7.7756 3.7427 3.8397 6.0015 5.4729 6.1933 8.2523 5.4903 4.6836 6.0560 2.8234 3.0586 7.6121 3.2123 5.0387 3.4181 7.4987 7.2764 2.8955 4.9223 6.0873 7.4762 6.9579 9.1828 4.9660 3.0448 6.9611 4.9442 5.9620 9.9233 5.6300 1.3605 7.2705 1.2821 1.2666 1.5293 3.9876 1.6549 1.5249 1.4360 1.7596 1.3673 1.4668 2.2069 1.5771 1.4440 2.8542 1.5923 5.3245 5.3417 3.1456 1.2728 1.3129 1.5226 1.1601 2.8642 5.9170 1.1162 3.4132 2.4701 1.2888 1.3127 1.4991 1.1700 7.7336 4.1162 10.0268 1.2633 3.6336 1.0620 3.7562 1.0869 1.0459 1.0488 1.1216 2.3326 2.5972 6.0688 7.8634 7.8968 6.6752 6.6659 1.0393 1.0603 1.0305 1.0968 1.0988 1.0993 1.0878 1.0890 1.1018 1.0964 1.0928 1.0968 1.1028 1.0892 1.0951 1.0972
irintensity: 0.5010 0.5886 0.4366 0.4019 0.1353 1.8343 4.5558 1.1428 4.2058 0.2928 1.3819 5.6732 1.8813 6.9578 10.5945 8.5031 1.1246 1.8092 1.0404 2.5546 2.1405 2.4338 12.3922 16.2592 26.0691 12.8841 0.0516 0.0215 45.7047 30.7948 8.6383 15.6885 7.6835 5.4268 1.4199 53.0204 43.0658 25.7690 0.5940 114.6673 18.0139 2.2319 68.9880 6.3528 24.5171 15.7917 0.3057 42.4488 237.3697 5.4845 7.9166 77.7618 192.5728 55.0015 6.0614 62.0423 1.3713 0.0960 31.7026 2.5147 1.9196 2.2678 0.1750 13.7283 20.4193 300.1969 25.1206 23.1804 17.5904 272.7763 34.0374 225.0988 282.2342 27.0881 16.5768 140.9350 0.4092 0.7203 24.0888 51.1579 87.8245 1.0195 32.7705 18.7389 15.3713 3.2185 23.9584 6.6618 13.1101 14.3257 20.3428 103.6283 0.5494 78.3759 46.5842 114.3939 240.6658 28.0996 31.8119 21.0667 8.7922 13.7462 9.2692 15.8748 8.2968 16.1475 2.0410 15.2879 4.6437 7.9997 3.9445 1.0562 1.1578 2.7903
temp: 298.150 k
press: 1.00000 atm
elementType: 15 8 8 8 8 8 8 7 6 6 6 6 6 6 6 6 6 6 6 6 6 6 6 6 1 1 1 1 1 1 1 1 1 1 1 1 1 1 1 1
symmnumber: 1
zpe: 768986.3 jmol-1
zpe.correction: 0.292891 hartree
zpe.thermalcorrener: 0.316138 hartree
zpe.thermalcorrenthalpy: 0.317082 hartree
zpe.thermalcorrgfe: 0.235832 hartree
zpe.sumelectzpe: -1464.795108 hartree
zpe.sumelectthermal: -1464.771861 hartree
zpe.sumelectthermalent: -1464.770917 hartree
zpe.sumelectthermalfe: -1464.852167 hartree
dipole: -8.0021 0.2648 -1.0822
dipole: 8.0792
quadrupole: -156.2331 -161.7734 -141.9920
quadrupole: 27.2278 -4.8432 -8.1492
quadrupole: -2.9003 -8.4406 11.3408 27.2278 -4.8432 -8.1492
hfenergy: -1465.087999 hartree
pointgroup: C01 [X(C16H16N1O6P1)]
dipole: -3.1540278 -0.2080086 0.335375 debye
polarizability: 240.4441755|3.5191806|286.2870212|-38.6776364|31.2889826|176.4051853 unknown
InChI: InChI=1S/C16H16NO6P/c1-12-3-5-13(6-4-12)16(18)11-22-24(2,21)23-15-9-7-14(8-10-15)17(19)20/h3-10H,11H2,1-2H3
charge 0 multiplicity 1
40 atoms
P  0.851271 -3.166291 -0.855088
O  -0.42304 -2.516936 -1.856745
O  0.903988 -2.027589 0.514047
O  2.213795 -3.330188 -1.653856
O  -2.216149 -2.516185 0.245049
O  4.890097 2.981608 0.366776
O  3.554447 3.51914 2.137745
N  3.910385 2.733448 1.173273
C  -1.135211 -1.280156 -1.55503
C  -2.972479 -0.241182 -0.040736
C  -2.13206 -1.424303 -0.38669
C  0.142407 -4.652456 -0.027277
C  1.700178 -0.873372 0.605767
C  -4.622935 1.973526 0.711794
C  -2.871158 1.002332 -0.722769
C  -3.911833 -0.362531 1.021896
C  -3.686739 2.089489 -0.348484
C  -4.720905 0.725129 1.388617
C  2.792736 -0.586859 -0.256494
C  1.344593 0.00849 1.659418
C  3.149831 1.482094 0.981313
C  3.516397 0.604507 -0.063364
C  2.072212 1.193185 1.851454
C  -5.491304 3.145903 1.123853
H  -0.430677 -0.449431 -1.349154
H  -1.678837 -1.043412 -2.487132
H  0.88061 -5.046482 0.68746
H  -0.786749 -4.34621 0.473355
H  -0.070617 -5.404966 -0.802609
H  -2.160915 1.137619 -1.545905
H  -3.984195 -1.324623 1.540104
H  -3.596661 3.042438 -0.882224
H  -5.440369 0.614584 2.208792
H  3.068902 -1.290757 -1.047237
H  0.503466 -0.256181 2.306169
H  4.362721 0.86083 -0.706098
H  1.82436 1.894865 2.65176
H  -6.559949 2.863703 1.148279
H  -5.227484 3.495907 2.140019
H  -5.378829 3.999715 0.435052
